{"text_format":"3","workbook":"xlsx","n_sheets":14,"sheets":["Title","Read Me","PCcheck_SI","Bow Load Calcs","Class Factors","bulbs","angles","half_I","WT (half_W)","cropped_I","flatbars","built_t","any","fort"],"not_rendered":{"images":9,"macros":1,"defined_names":126,"comments":1},"read":"whole","date_system":"1900"}

{"sheet":"Title","index":0,"n_rows":0,"n_cols":0,"rows_kept":0}

{"sheet":"Read Me","index":1,"n_rows":5,"n_cols":1,"rows_kept":5}
[]
[]
[]
[]
["PC.design&check"]

{"sheet":"PCcheck_SI","index":2,"n_rows":122,"n_cols":32,"rows_kept":122}
[]
[]
[null,"PC.design&check  SI"]
[null,"IACS Unified Requirements for Polar Class Ships - Calculations",{"$nulls":7}," <=  macros",{"$nulls":18},"Q","Hull Areas","Questions","Frame Types"]
[]
[{"$nulls":28},"check","Bi","Yes","bulbs"]
[{"$nulls":4},"check","check","check","check","check","check","check","check","check","check",{"$nulls":14}," - ","BIi","No","angles"]
[null,"Vessel Particulars",null,null,1,2,3,4,5,6,7,8,9,10,{"$nulls":15},"BIl",null,"half_I"]
[null,"Item","Units","Var","Value","Value","Value","Value","Value","Value","Value","Value","Value","Value",{"$nulls":15},"BIb",null,"cropped_I"]
[null,"PC Class",null,"Class",7,{"$f":"Class","v":7},7,7,7,7,7,7,7,7,null,null,"user edit values in green only",{"$nulls":12},"Mi",null,"flatbars"]
[null,"Displacement","kt","Disp",{"v":50,"d":"50.0"},{"v":50,"d":"50.0"},{"v":50,"d":"50.0"},{"v":50,"d":"50.0"},{"v":50,"d":"50.0"},{"v":50,"d":"50.0"},{"v":50,"d":"50.0"},{"v":50,"d":"50.0"},{"v":50,"d":"50.0"},{"v":50,"d":"50.0"},null,null,"macros fill the purple cells, but users may overwrite",{"$nulls":12},"Ml",null,"built_t"]
[null,"Displacement Class Factor",null,"Cfdis",{"$f":"VLOOKUP(Class,class_tab,2)","v":{"v":22,"d":"22.00"}},{"$f":"VLOOKUP(Class,class_tab,2)","v":{"v":22,"d":"22.00"}},{"v":22,"d":"22.00"},{"v":22,"d":"22.00"},{"v":22,"d":"22.00"},{"v":22,"d":"22.00"},{"v":22,"d":"22.00"},{"v":22,"d":"22.00"},{"v":22,"d":"22.00"},{"v":22,"d":"22.00"},{"$nulls":15},"Mb",null,"fort"]
[null,"Crushing Failure Class Factor",null,"CFc",{"$f":"VLOOKUP(Class,class_tab,3)","v":{"v":1.8,"d":"1.800"}},{"$f":"VLOOKUP(Class,class_tab,3)","v":{"v":1.8,"d":"1.800"}},{"v":1.8,"d":"1.800"},{"v":1.8,"d":"1.800"},{"v":1.8,"d":"1.800"},{"v":1.8,"d":"1.800"},{"v":1.8,"d":"1.800"},{"v":1.8,"d":"1.800"},{"v":1.8,"d":"1.800"},{"v":1.8,"d":"1.800"},{"$nulls":15},"Si",null,"any"]
[null,"Flexural Failure Class Factor",null,"CFf",{"$f":"VLOOKUP(Class,class_tab,4)","v":{"v":4.06,"d":"4.060"}},{"$f":"VLOOKUP(Class,class_tab,4)","v":{"v":4.06,"d":"4.060"}},{"v":4.06,"d":"4.060"},{"v":4.06,"d":"4.060"},{"v":4.06,"d":"4.060"},{"v":4.06,"d":"4.060"},{"v":4.06,"d":"4.060"},{"v":4.06,"d":"4.060"},{"v":4.06,"d":"4.060"},{"v":4.06,"d":"4.060"},{"$nulls":15},"Sl"]
[{"$nulls":3},"CFd",{"$f":"VLOOKUP(Class,class_tab,5)","v":{"v":1.11,"d":"1.110"}},{"$f":"VLOOKUP(Class,class_tab,5)","v":{"v":1.11,"d":"1.110"}},{"v":1.11,"d":"1.110"},{"v":1.11,"d":"1.110"},{"v":1.11,"d":"1.110"},{"v":1.11,"d":"1.110"},{"v":1.11,"d":"1.110"},{"v":1.11,"d":"1.110"},{"v":1.11,"d":"1.110"},{"v":1.11,"d":"1.110"},{"$nulls":15},"Sb"]
[null,"Load Patch Dimensions Class Factor",null,"CFb",{"$f":"VLOOKUP(Class,class_tab,6)","v":{"v":2.6,"d":"2.600"}},{"$f":"VLOOKUP(Class,class_tab,6)","v":{"v":2.6,"d":"2.600"}},{"v":2.6,"d":"2.600"},{"v":2.6,"d":"2.600"},{"v":2.6,"d":"2.600"},{"v":2.6,"d":"2.600"},{"v":2.6,"d":"2.600"},{"v":2.6,"d":"2.600"},{"v":2.6,"d":"2.600"},{"v":2.6,"d":"2.600"}]
[]
[null,"Offered Frame Data"]
[null,"Item","Units","Var","   Frames ………… (copy more columns if desired)"]
[null,"Case Frame Number","--","FrameNum","any","any","any","any","any","any","any","any","any","any"]
[null,"Case Frame Description","--","FrameRef","HP 300*14.0","HP 280*14.0","HP 220*10.0","HP 180*8.0","T 200 x 9, 110 x 9","HP 180*8.0","IPE 120 A_cropped","HP 200*9.0","HP 180*8.0","HP 100*6.0"]
[null,"Hull Region","--","HA","Bi","BIi","BIl","BIb","Mi","Ml","Mb","Si","Sl","Sb"]
[null,"Hull Family","--","HF",1,1,1,1,1,1,1,1,1,1]
[null,"Frame Orientation Angle (to waterline)","deg","OA",90,90,90,90,90,90,90,90,90,90]
[null,"Frame Orientation Type","--","FO",{"$f":"IF(OR(HA=\"Bib\",HA=\"Sb\",HA=\"Mb\"),\"Transverse\",IF(E24>=70,\"Transverse\",IF(E24<=20,\"Longitudinal\",\"Between\")))","v":"Transverse"},"Transverse","Transverse",{"$f":"IF(OR(HA=\"Bib\",HA=\"Sb\",HA=\"Mb\"),\"Transverse\",IF(H24>=70,\"Transverse\",IF(H24<=20,\"Longitudinal\",\"Between\")))","v":"Transverse"},"Transverse","Transverse","Transverse","Transverse","Transverse","Transverse"]
[null,"Protective Hull Coating Used?","yes/no","Coating?","Yes","Yes","Yes","Yes","Yes","Yes","Yes","Yes","Yes","Yes"]
[null,"Bottom Longitudinals?","yes/no","BotLongs?","No","No","No","No","No","No","No","No","No","No"]
[null,"Load Distributing Stringers?","yes/no","LDString?","No","No","No","No","No","No","No","No","No","No"]
[null,"Water Density","t/m3","rhow",1.025,1.025,1.025,1.025,1.025,1.025,1.025,1.025,1.025,1.025]
[null,"Frame Attachment Parameter","--","j",2,2,2,2,2,2,2,2,2,2]
[null,"Yield Strength - Framing Material","MPa","Fy_f",350,350,350,350,350,350,350,350,350,350]
[null,"Yield Strength - Plating Material","MPa","Fy_p",350,350,350,350,350,350,350,350,350,350]
[null,"Young's Modulus of Plating Material","MPa","E_plate",207000,207000,207000,207000,207000,207000,207000,207000,207000,207000]
[null,"Main Frame Span (=web frame spacing for long'l)","mm","a",2000,{"$f":"E34","v":2000},{"$f":"F34","v":2000},2000,2000,2000,2000,2000,2000,2000]
[null,"Main Frame Spacing","mm","s",380,{"$f":"E35","v":380},{"$f":"F35","v":380},380,380,380,380,380,380,380]
[null,"Thickness of Plate (gross)","mm","tp",19.5,18.5,13.5,10.5,{"v":13,"d":"13.0"},10.5,{"v":7,"d":"7.0"},{"v":12,"d":"12.0"},10.5,{"v":10,"d":"10.0"}]
[null,"Height of Web","mm","hw",268.18,250.4,197.06,161.5,200,161.5,100.80000000000001,179.28,161.5,88.53]
[null,"Thickness of Web (gross)","mm","tw",{"v":14,"d":"14.0"},{"v":14,"d":"14.0"},{"v":10,"d":"10.0"},{"v":8,"d":"8.0"},{"v":9,"d":"9.0"},{"v":8,"d":"8.0"},3.8,{"v":9,"d":"9.0"},{"v":8,"d":"8.0"},{"v":6,"d":"6.0"}]
[null,"Angle of web","deg","fiw",90,90,90,90,90,90,90,90,90,90]
[null,"Width of Flange","mm","wf",57,54,41,33,110,33,64,37,33,21.5]
[null,"Thickness of Flange (gross)","mm","tf",{"v":31.82,"d":"31.8"},29.6,{"v":22.94,"d":"22.9"},18.5,{"v":9,"d":"9.0"},18.5,5.1,{"v":20.72,"d":"20.7"},18.5,{"v":11.47,"d":"11.5"}]
[null,"Flange Offset Distance","mm","bw",0,0,0,0,0,0,0,0,0,0,"non-ice"]
[{"$nulls":3},"pl&fr&Str tonnes/m2",{"$f":"(tp*s+hw*tw+tf*wf)/s/1000*7.8+E127","v":{"v":0.2663958631578947,"d":"0.266"}},{"$f":"(tp*s+hw*tw+tf*wf)/s/1000*7.8+F127","v":{"v":0.2490663157894737,"d":"0.249"}},{"v":0.16505497894736842,"d":"0.165"},{"v":0.12095131578947368,"d":"0.121"},{"v":0.15866842105263157,"d":"0.159"},{"v":0.12095131578947368,"d":"0.121"},{"v":0.06916218947368422,"d":"0.069"},{"v":0.1424559157894737,"d":"0.142"},{"v":0.12095131578947368,"d":"0.121"},{"v":0.09396506052631579,"d":"0.094"},0.2,"total"]
[{"$nulls":3},"area  m2",637,{"v":294.4,"d":"294"},{"v":535.4,"d":"535"},540,{"v":168.4,"d":"168"},{"v":258.4,"d":"258"},{"v":417.2,"d":"417"},{"v":512.8,"d":"513"},{"v":776.6,"d":"777"},{"v":114.6,"d":"115"},1622,{"$f":"SUM(E44:O44)","v":{"v":5876.8,"d":"5877"}},"m2","example only"]
[{"$nulls":3},"Tonnes",{"$f":"E43*E44","v":{"v":169.69416483157892,"d":"170"}},{"$f":"F43*F44","v":{"v":73.32512336842105,"d":"73"}},{"v":88.37043572842106,"d":"88"},{"v":65.31371052631579,"d":"65"},{"v":26.719762105263158,"d":"27"},{"v":31.253819999999997,"d":"31"},{"v":28.854465448421053,"d":"29"},{"v":73.0513936168421,"d":"73"},{"$f":"M43*M44","v":{"v":93.93079184210526,"d":"94"}},{"v":10.76839593631579,"d":"11"},{"v":324.40000000000003,"d":"324"},{"$f":"SUM(E45:O45)","v":{"v":985.6820634036842,"d":"986"}},"Tonnes"]
[null,"Assesment Results for Offered Frames (net)"]
[null,"Web Buckling Constant","--","wbc",{"$f":"hw/tw*SQRT(Fy_f)","v":{"v":358.3705992803699,"d":"358.4"}},{"$f":"hw/tw*SQRT(Fy_f)","v":{"v":334.6110748743554,"d":"334.6"}},{"$f":"hw/tw*SQRT(Fy_f)","v":{"v":368.66550231883645,"d":"368.7"}},{"$f":"hw/tw*SQRT(Fy_f)","v":{"v":377.6735424774947,"d":"377.7"}},{"$f":"hw/tw*SQRT(Fy_f)","v":{"v":415.73970964154904,"d":"415.7"}},{"v":377.6735424774947,"d":"377.7"},{"v":496.26192708791234,"d":"496.3"},{"v":372.6690757226846,"d":"372.7"},{"v":377.6735424774947,"d":"377.7"},{"v":276.04077370924756,"d":"276.0"}]
[null,"Frame Stability Check (12.9.1)","--","frstab",{"$f":"IF(OR(tf=0,wf=0),IF(wbc>282,\"FAIL\",\"OK\"),IF(wbc>805,\"FAIL\",\"OK\"))","v":"OK"},"OK","OK","OK","OK","OK","OK","OK","OK","OK"]
[null,"Web Thickness Min (12.9.3)","--","webmin",{"$f":"IF(tw<0.35*tp*SQRT(Fy_f/235),\"FAIL\",\"OK\")","v":"OK"},"OK","OK","OK","OK","OK","OK","OK","OK","OK"]
[null,"Dist. to Plastc NA","mm","zna",{"$f":"IF(s*tp >hw*tw+wf*tf,0,(wf*tf+hw*tw-tp*s)/(2*tw))","v":{"v":0,"d":"0.0"}},{"v":0,"d":"0.0"},{"v":0,"d":"0.0"},{"v":0,"d":"0.0"},{"v":0,"d":"0.0"},{"v":0,"d":"0.0"},{"v":0,"d":"0.0"},{"v":0,"d":"0.0"},{"v":0,"d":"0.0"},{"v":0,"d":"0.0"}]
[null,"Shell Plate Thickness  - offered (net)","mm","tp",{"$f":"tp-E70","v":17.5},{"$f":"tp-F70","v":16.5},{"$f":"tp-G70","v":11.5},8.5,{"$f":"tp-I70","v":{"v":11,"d":"11.0"}},8.5,{"v":5,"d":"5.0"},{"v":10,"d":"10.0"},8.5,{"v":8,"d":"8.0"}]
[null,"required value (12.4.2) (excl CA)","mm","t_reqd",{"$f":"E117","v":{"v":17.098137451591956,"d":"17.1"}},{"$f":"F117","v":{"v":16.218453029030986,"d":"16.2"}},{"v":11.468178117183312,"d":"11.5"},{"v":8.109226514515493,"d":"8.1"},{"$f":"I117","v":{"v":10.879669038840198,"d":"10.9"}},{"v":8.109226514515493,"d":"8.1"},{"v":3.6265563462800654,"d":"3.6"},{"v":9.594966207820097,"d":"9.6"},{"v":8.109226514515493,"d":"8.1"},{"v":3.6265563462800654,"d":"3.6"}]
[{"$nulls":4},{"$f":"IF(E51<E52,\"FAIL\",\"OK\")","v":"OK"},{"$f":"IF(F51<F52,\"FAIL\",\"OK\")","v":"OK"},"OK","OK",{"$f":"IF(I51<I52,\"FAIL\",\"OK\")","v":"OK"},"OK","OK","OK","OK","OK"]
[null,"Frame Shear Area - offered (12.5.7) (net)","cm2","Aw",{"$f":"(hw+tf)*(tw-1)*SIN(fiw*deg)/100","v":{"v":39,"d":"39.0"}},{"$f":"(hw+tf)*(tw-1)*SIN(fiw*deg)/100","v":36.4},{"$f":"(hw+tf)*(tw-1)*SIN(fiw*deg)/100","v":19.8},{"$f":"(hw+tf)*(tw-1)*SIN(fiw*deg)/100","v":12.6},{"$f":"(hw+tf)*(tw-1)*SIN(fiw*deg)/100","v":{"v":16.72,"d":"16.7"}},12.6,{"v":2.9652,"d":"3.0"},{"v":16,"d":"16.0"},12.6,{"v":5,"d":"5.0"}]
[null,"required value (12.6.2 or 12.7.2 )","cm2","At or AL",{"$f":"E121","v":{"v":32.18309303920928,"d":"32.2"}},{"$f":"F121","v":{"v":29.681211260864774,"d":"29.7"}},{"v":14.840605630432387,"d":"14.8"},{"v":7.420302815216194,"d":"7.4"},{"$f":"I121","v":{"v":13.356545067389147,"d":"13.4"}},{"v":7.420302815216194,"d":"7.4"},{"v":1.4840605630432389,"d":"1.5"},{"v":10.38842394130267,"d":"10.4"},{"v":7.420302815216194,"d":"7.4"},{"v":1.4840605630432389,"d":"1.5"}]
[{"$nulls":4},{"$f":"IF(E54<E55,\"FAIL\",\"OK\")","v":"OK"},{"$f":"IF(F54<F55,\"FAIL\",\"OK\")","v":"OK"},"OK","OK",{"$f":"IF(I54<I55,\"FAIL\",\"OK\")","v":"OK"},"OK","OK","OK","OK","OK"]
[null,"Frame Modulus - offered (12.5.8) (net)","cm3","Zp",{"$f":"IF((s*E51) > (hw*(tw-1)+wf*(tf-1)),((tf-1)*wf+hw*(tw-1))*E51/2+hw^2*(tw-1)/2*SIN(fiw*deg)+(tf-1)*wf*((hw+tf/2)*SIN(fiw*deg)-bw*COS(fiw*deg)),s*(tp-E70)*(zna+(tp-E70)/2)*SIN(fiw*deg)+((hw-zna)^2+zna^2)*(tw-1)/2*SIN(fiw*deg)+wf*(tf-1)*((hw+tf/2-zna)*SIN(fiw*deg)-bw*COS(fiw*deg)))/1000","v":{"v":1012.4325472000002,"d":"1012.4"}},{"$f":"IF((s*F51) > (hw*(tw-1)+wf*(tf-1)),((tf-1)*wf+hw*(tw-1))*F51/2+hw^2*(tw-1)/2*SIN(fiw*deg)+(tf-1)*wf*((hw+tf/2)*SIN(fiw*deg)-bw*COS(fiw*deg)),s*(tp-F70)*(zna+(tp-F70)/2)*SIN(fiw*deg)+((hw-zna)^2+zna^2)*(tw-1)/2*SIN(fiw*deg)+wf*(tf-1)*((hw+tf/2-zna)*SIN(fiw*deg)-bw*COS(fiw*deg)))/1000","v":{"v":856.7226200000001,"d":"856.7"}},{"v":377.69818240000006,"d":"377.7"},{"v":197.155,"d":"197.2"},353.6,{"v":197.155,"d":"197.2"},{"v":42.70553600000001,"d":"42.7"},{"v":277.7536032,"d":"277.8"},{"v":197.155,"d":"197.2"},{"v":43.484445075000004,"d":"43.5"}]
[null,"required value (12.6.3 or 12.7.3)","cm3","Zpt or ZpL",{"$f":"E122","v":{"v":912.8903769358043,"d":"912.9"}},{"$f":"F122","v":{"v":773.5379403599375,"d":"773.5"}},{"v":375.367866071689,"d":"375.4"},{"v":179.92148418481995,"d":"179.9"},{"$f":"I122","v":{"v":340.0567897419982,"d":"340.1"}},{"v":179.92148418481995,"d":"179.9"},{"v":35.01317045626234,"d":"35.0"},{"v":255.32491474521393,"d":"255.3"},{"v":179.92148418481995,"d":"179.9"},{"v":34.544001501288605,"d":"34.5"}]
[{"$nulls":4},{"$f":"IF(E57<E58,\"FAIL\",\"OK\")","v":"OK"},{"$f":"IF(F57<F58,\"FAIL\",\"OK\")","v":"OK"},{"$f":"IF(G57<G58,\"FAIL\",\"OK\")","v":"OK"},{"$f":"IF(H57<H58,\"FAIL\",\"OK\")","v":"OK"},{"$f":"IF(I57<I58,\"FAIL\",\"OK\")","v":"OK"},"OK","OK","OK","OK","OK"]
[]
[null,"Load Parameters"]
[null,"Force","MN","F",{"$f":"IF(HA=\"Bi\",Fmax,0.36*CFc*IF(Disp<=Cfdis,Disp^0.64,Cfdis^0.64+0.1*(Disp-Cfdis)))","v":{"v":7.473685048199302,"d":"7.474"}},{"$f":"IF(HA=\"Bi\",Fmax,0.36*F13*IF(F11<=F12,F11^0.64,F12^0.64+0.1*(F11-F12)))","v":{"v":6.499571810669502,"d":"6.500"}},{"$f":"IF(HA=\"Bi\",Fmax,0.36*G13*IF(G11<=G12,G11^0.64,G12^0.64+0.1*(G11-G12)))","v":{"v":6.499571810669502,"d":"6.500"}},{"v":6.499571810669502,"d":"6.500"},{"v":6.499571810669502,"d":"6.500"},{"v":6.499571810669502,"d":"6.500"},{"v":6.499571810669502,"d":"6.500"},{"v":6.499571810669502,"d":"6.500"},{"v":6.499571810669502,"d":"6.500"},{"v":6.499571810669502,"d":"6.500"}]
[null,"Aspect Ratio",null,"AR",{"$f":"IF(HA=\"Bi\",ARbow,3.6)","v":{"v":4.932394036297807,"d":"4.932"}},{"v":3.6,"d":"3.600"},{"v":3.6,"d":"3.600"},{"v":3.6,"d":"3.600"},{"v":3.6,"d":"3.600"},{"v":3.6,"d":"3.600"},{"v":3.6,"d":"3.600"},{"v":3.6,"d":"3.600"},{"v":3.6,"d":"3.600"},{"v":3.6,"d":"3.600"}]
[null,"Line Load","MN/m","Q",{"$f":"IF(HA=\"Bi\",Qmax,0.639*E62^0.61*CFd)","v":{"v":2.408960577934883,"d":"2.409"}},{"$f":"IF(HA=\"Bi\",Qmax,0.639*F62^0.61*CFd)","v":{"v":2.2216903684698446,"d":"2.222"}},{"v":2.2216903684698446,"d":"2.222"},{"v":2.2216903684698446,"d":"2.222"},{"v":2.2216903684698446,"d":"2.222"},{"v":2.2216903684698446,"d":"2.222"},{"v":2.2216903684698446,"d":"2.222"},{"v":2.2216903684698446,"d":"2.222"},{"v":2.2216903684698446,"d":"2.222"},{"v":2.2216903684698446,"d":"2.222"}]
[null,"Pressure","MPa","P",{"$f":"IF(HA=\"Bi\",Pmax,E64/E67)","v":{"v":3.0859488425637154,"d":"3.086"}},{"$f":"IF(HA=\"Bi\",Pmax,F64/F67)","v":{"v":2.733913810583111,"d":"2.734"}},{"$f":"IF(HA=\"Bi\",Pmax,G64/G67)","v":{"v":2.733913810583111,"d":"2.734"}},{"v":2.733913810583111,"d":"2.734"},{"v":2.733913810583111,"d":"2.734"},{"v":2.733913810583111,"d":"2.734"},{"v":2.733913810583111,"d":"2.734"},{"v":2.733913810583111,"d":"2.734"},{"v":2.733913810583111,"d":"2.734"},{"v":2.733913810583111,"d":"2.734"}]
[null,"Ice Load Patch Width","m","w",{"$f":"IF(HA=\"Bi\",wbow,E62/E64)","v":{"v":3.102452201441266,"d":"3.102"}},{"$f":"IF(HA=\"Bi\",wbow,F62/F64)","v":{"v":2.925507488762254,"d":"2.926"}},{"v":2.925507488762254,"d":"2.926"},{"v":2.925507488762254,"d":"2.926"},{"v":2.925507488762254,"d":"2.926"},{"v":2.925507488762254,"d":"2.926"},{"v":2.925507488762254,"d":"2.926"},{"v":2.925507488762254,"d":"2.926"},{"v":2.925507488762254,"d":"2.926"},{"v":2.925507488762254,"d":"2.926"}]
[null,"Ice Load Patch Height","m","b",{"$f":"IF(HA=\"Bi\",bbow,E66/3.6)","v":{"v":0.780622330710314,"d":"0.781"}},{"$f":"IF(HA=\"Bi\",bbow,F66/3.6)","v":{"v":0.812640969100626,"d":"0.813"}},{"v":0.812640969100626,"d":"0.813"},{"v":0.812640969100626,"d":"0.813"},{"v":0.812640969100626,"d":"0.813"},{"v":0.812640969100626,"d":"0.813"},{"v":0.812640969100626,"d":"0.813"},{"v":0.812640969100626,"d":"0.813"},{"v":0.812640969100626,"d":"0.813"},{"v":0.812640969100626,"d":"0.813"}]
[null,"Average Patch Pressure","MPa","Pavg",{"$f":"E62/E66/E67","v":{"v":3.0859488425637154,"d":"3.086"}},{"$f":"F62/F66/F67","v":{"v":2.733913810583111,"d":"2.734"}},{"$f":"G62/G66/G67","v":{"v":2.733913810583111,"d":"2.734"}},{"$f":"H62/H66/H67","v":{"v":2.733913810583111,"d":"2.734"}},{"$f":"I62/I66/I67","v":{"v":2.733913810583111,"d":"2.734"}},{"v":2.733913810583111,"d":"2.734"},{"v":2.733913810583111,"d":"2.734"},{"v":2.733913810583111,"d":"2.734"},{"v":2.733913810583111,"d":"2.734"},{"v":2.733913810583111,"d":"2.734"}]
[null,"Hull Area Factor",null,"AF",{"$f":"VLOOKUP(Class,HAF_tab_r,HLOOKUP(HA,HAF_tab_r,2,FALSE))","v":1},{"$f":"VLOOKUP(Class,HAF_tab_r,HLOOKUP(HA,HAF_tab_r,2,FALSE))","v":1},0.5,0.25,0.45,0.25,0.05,0.35,0.25,0.05]
[null,"Corrosion and Abrasion Allowance","mm","t_wear",{"$f":"IF(Coating?=\"Yes\",VLOOKUP(Class,WA_coat_tab,HLOOKUP(HA,WA_coat_tab,2,FALSE)),VLOOKUP(Class,WA_nocoat_tab,HLOOKUP(HA,WA_nocoat_tab,2,FALSE)))","v":2},2,2,2,2,2,2,2,2,2]
[]
[null,"Transverse Plating"]
[null,"Peak Pressure Factor - Plate (trans)"," - ","PPFpt",{"$f":"MAX(1.8-s/1000,1.2)","v":1.42},1.42,1.42,1.42,1.42,1.42,1.42,1.42,1.42,1.42]
[null,"height of design load patch","m","bpt",{"$f":"MIN(b*1,a/1000-s/4000)","v":{"v":0.780622330710314,"d":"0.781"}},{"$f":"MIN(b*1,a/1000-s/4000)","v":{"v":0.812640969100626,"d":"0.813"}},{"v":0.812640969100626,"d":"0.813"},{"v":0.812640969100626,"d":"0.813"},{"v":0.812640969100626,"d":"0.813"},{"v":0.812640969100626,"d":"0.813"},{"v":0.812640969100626,"d":"0.813"},{"v":0.812640969100626,"d":"0.813"},{"v":0.812640969100626,"d":"0.813"},{"v":0.812640969100626,"d":"0.813"}]
[null,"Plate Thickness Required to Resist Ice Load","mm","t_net",{"$f":"0.5*s*SQRT(AF*PPFpt*Pavg/Fy_p)/(1+s/(2000*bt))","v":{"v":17.098137451591956,"d":"17.1"}},{"v":16.218453029030986,"d":"16.2"},{"v":11.468178117183312,"d":"11.5"},{"v":8.109226514515493,"d":"8.1"},{"v":10.879669038840198,"d":"10.9"},{"v":8.109226514515493,"d":"8.1"},{"v":3.6265563462800654,"d":"3.6"},{"v":9.594966207820097,"d":"9.6"},{"v":8.109226514515493,"d":"8.1"},{"v":3.6265563462800654,"d":"3.6"}]
[null,"Required Minimum Shell Plate Thickness","mm","t_min",{"$f":"E75+E70","v":{"v":19.098137451591956,"d":"19.098"}},{"$f":"F75+F70","v":{"v":18.218453029030986,"d":"18.218"}},{"$f":"G75+G70","v":{"v":13.468178117183312,"d":"13.468"}},{"$f":"H75+H70","v":{"v":10.109226514515493,"d":"10.109"}},{"$f":"I75+I70","v":{"v":12.879669038840198,"d":"12.880"}},{"v":10.109226514515493,"d":"10.109"},{"v":5.626556346280065,"d":"5.627"},{"v":11.594966207820097,"d":"11.595"},{"v":10.109226514515493,"d":"10.109"},{"v":5.626556346280065,"d":"5.627"}]
[]
[null,"Transverse Framing"]
[null,"Peak Pressure Factor - Transverse Frame"," -","PPFt",{"$f":"IF(LDString?=\"Yes\",MAX(1.6-s/1000,1),MAX(1.8-s/1000,1.2))","v":1.42},1.42,1.42,1.42,1.42,1.42,1.42,1.42,1.42,1.42]
[null,"Length of Loaded Portion of Span","m","LL",{"$f":"IF(a/1000<b,a/1000,b)","v":{"v":0.780622330710314,"d":"0.781"}},{"v":0.812640969100626,"d":"0.813"},{"v":0.812640969100626,"d":"0.813"},{"v":0.812640969100626,"d":"0.813"},{"v":0.812640969100626,"d":"0.813"},{"v":0.812640969100626,"d":"0.813"},{"v":0.812640969100626,"d":"0.813"},{"v":0.812640969100626,"d":"0.813"},{"v":0.812640969100626,"d":"0.813"},{"v":0.812640969100626,"d":"0.813"}]
[null,"Required Shear Area of Transverse Frame","cm2","At",{"$f":"100^2*0.5*LL*s/1000*(AF*PPFt*Pavg)/(0.577*Fy_f)","v":{"v":32.18309303920928,"d":"32.2"}},{"v":29.681211260864774,"d":"29.7"},{"v":14.840605630432387,"d":"14.8"},{"v":7.420302815216194,"d":"7.4"},{"v":13.356545067389147,"d":"13.4"},{"v":7.420302815216194,"d":"7.4"},{"v":1.4840605630432389,"d":"1.5"},{"v":10.38842394130267,"d":"10.4"},{"v":7.420302815216194,"d":"7.4"},{"v":1.4840605630432389,"d":"1.5"}]
[null,"Ratio of Minimum Shear Area / Fitted Shear Area",null,"a_1",{"$f":"E81/E54","v":{"v":0.8252075138258791,"d":"0.825"}},{"$f":"F81/F54","v":{"v":0.8154178917819993,"d":"0.815"}},{"$f":"G81/G54","v":{"v":0.7495255368905246,"d":"0.750"}},{"$f":"H81/H54","v":{"v":0.5889129218425551,"d":"0.589"}},{"$f":"I81/I54","v":{"v":0.7988364274754275,"d":"0.799"}},{"v":0.5889129218425551,"d":"0.589"},{"v":0.5004925681381488,"d":"0.500"},{"v":0.6492764963314169,"d":"0.649"},{"v":0.5889129218425551,"d":"0.589"},{"v":0.29681211260864776,"d":"0.297"}]
[]
[null,"Load Length Parameter"," -","Y",{"$f":"1-0.5*(LL/a*1000)","v":{"v":0.8048444173224215,"d":"0.805"}},{"$f":"1-0.5*(LL/a*1000)","v":{"v":0.7968397577248435,"d":"0.797"}},{"v":0.7968397577248435,"d":"0.797"},{"v":0.7968397577248435,"d":"0.797"},{"v":0.7968397577248435,"d":"0.797"},{"v":0.7968397577248435,"d":"0.797"},{"v":0.7968397577248435,"d":"0.797"},{"v":0.7968397577248435,"d":"0.797"},{"v":0.7968397577248435,"d":"0.797"},{"v":0.7968397577248435,"d":"0.797"}]
[null,"Shear Parameter"," -","kw",{"$f":"1/(1+2*wf*tf/((hw+tf)*tw))","v":{"v":0.5365711570007206,"d":"0.537"}},{"v":0.5508093525179856,"d":"0.551"},{"v":0.5390729904829114,"d":"0.539"},{"v":0.5411499436302142,"d":"0.541"},{"v":0.4871794871794872,"d":"0.487"},{"v":0.5411499436302142,"d":"0.541"},{"v":0.3813612327287201,"d":"0.381"},{"v":0.5400086401382422,"d":"0.540"},{"v":0.5411499436302142,"d":"0.541"},{"v":0.5488423999048673,"d":"0.549"}]
[null,"Width of Plating Acting Effectively With Frame","mm","beff",{"$f":"s/2","v":190},190,190,190,190,190,190,190,190,190]
[null,"Sum of Plastic Moduli of Flange and Plate","cm3","z_p",{"$f":"(wf*tf^2/4+beff*tp^2/4)/1000","v":{"v":32.490176700000006,"d":"32.5"}},{"v":28.085035000000005,"d":"28.1"},{"v":14.0508719,"d":"14.1"},{"v":8.0604375,"d":"8.1"},{"v":10.255,"d":"10.3"},{"v":8.0604375,"d":"8.1"},{"v":2.7436599999999998,"d":"2.7"},{"v":10.8111952,"d":"10.8"},{"v":8.0604375,"d":"8.1"},{"v":5.4571398375,"d":"5.5"}]
[null,"Shear Parameter"," -","kz",{"$f":"z_p/Zp","v":{"v":0.03209120132482442,"d":"0.0321"}},{"v":0.032781946390069636,"d":"0.0328"},{"v":0.037201322523494354,"d":"0.0372"},{"v":0.04088375897136771,"d":"0.0409"},{"v":0.029001696832579187,"d":"0.0290"},{"v":0.04088375897136771,"d":"0.0409"},{"v":0.0642460031411384,"d":"0.0642"},{"v":0.03892369018959319,"d":"0.0389"},{"v":0.04088375897136771,"d":"0.0409"},{"v":0.12549636607039072,"d":"0.1255"}]
[null,"Interaction Eq For 3H Mechanism (Sym Load)"," -","A1A",{"$f":"IF(a_1>1,1000,1/(1+j/2+kw*j/2*((1-a_1^2)^0.5-1)))","v":{"v":0.566091091332346,"d":"0.566"}},{"v":0.5655983280758565,"d":"0.566"},{"v":0.5501215514348984,"d":"0.550"},{"v":0.5273689889976858,"d":"0.527"},{"v":0.5537458810638703,"d":"0.554"},{"v":0.5273689889976858,"d":"0.527"},{"v":0.5131366159183951,"d":"0.513"},{"v":0.5345603260745013,"d":"0.535"},{"v":0.5273689889976858,"d":"0.527"},{"v":0.5062606956086384,"d":"0.506"}]
[null,"Interaction Eq For Shear Mechanism (Asym Load)"," -","A1B",{"$f":"(1-1/(2*a_1*Y))/(0.275+1.44*kz^0.7)","v":{"v":0.6108057252520582,"d":"0.611"}},{"v":0.5668304752587608,"d":"0.567"},{"v":0.38880801486220423,"d":"0.389"},{"v":-0.1527843332051081,"d":"-0.153"},{"v":0.5419664759797502,"d":"0.542"},{"v":-0.1527843332051081,"d":"-0.153"},{"v":-0.5222856910117694,"d":"-0.522"},{"v":0.0792873600514431,"d":"0.079"},{"v":-0.1527843332051081,"d":"-0.153"},{"v":-1.8208808424064309,"d":"-1.821"}]
[null,"Interaction parameter"," -","A1_",{"$f":"MAX(E89,E90)","v":{"v":0.6108057252520582,"d":"0.611"}},{"$f":"MAX(F89,F90)","v":{"v":0.5668304752587608,"d":"0.567"}},{"$f":"MAX(G89,G90)","v":{"v":0.5501215514348984,"d":"0.550"}},{"$f":"MAX(H89,H90)","v":{"v":0.5273689889976858,"d":"0.527"}},{"$f":"MAX(I89,I90)","v":{"v":0.5537458810638703,"d":"0.554"}},{"v":0.5273689889976858,"d":"0.527"},{"v":0.5131366159183951,"d":"0.513"},{"v":0.5345603260745013,"d":"0.535"},{"v":0.5273689889976858,"d":"0.527"},{"v":0.5062606956086384,"d":"0.506"}]
[null,"Required Plastic Section Modulus of Transverse Frame","cm3","Zpt",{"$f":"100^3*LL*Y*s/1000*(AF*PPFt*Pavg*a/1000*A1_/(4*Fy_f))","v":{"v":912.8903769358043,"d":"912.9"}},{"v":773.5379403599375,"d":"773.5"},{"v":375.367866071689,"d":"375.4"},{"v":179.92148418481995,"d":"179.9"},{"v":340.0567897419982,"d":"340.1"},{"v":179.92148418481995,"d":"179.9"},{"v":35.01317045626234,"d":"35.0"},{"v":255.32491474521393,"d":"255.3"},{"v":179.92148418481995,"d":"179.9"},{"v":34.544001501288605,"d":"34.5"}]
[]
[null,"Longitudinal Plating (b>=s)"]
[null,"Peak Pressure Factor - Plate (longl)"," - ","PPFpl",{"$f":"MAX(2.2-1.2*s/1000,1.5)","v":1.7440000000000002},1.7440000000000002,1.7440000000000002,1.7440000000000002,1.7440000000000002,1.7440000000000002,1.7440000000000002,1.7440000000000002,1.7440000000000002,1.7440000000000002]
[null,"Plate Thickness Required to Resist Ice Load","mm","t_net",{"$f":"0.5*s*SQRT(AF*PPFpl*Pavg/Fy_p)/(1+s/(2*a))","v":{"v":21.516571004618363,"d":"21.52"}},{"v":20.2521487854331,"d":"20.3"},{"v":14.320431739778645,"d":"14.3"},{"v":10.12607439271655,"d":"10.1"},{"v":13.585554412400464,"d":"13.6"},{"v":10.12607439271655,"d":"10.1"},{"v":4.528518137466821,"d":"4.5"},{"v":11.981332799382617,"d":"12.0"},{"v":10.12607439271655,"d":"10.1"},{"v":4.528518137466821,"d":"4.5"}]
[null,"Required Minimum Shell Plate Thickness","mm","t_min",{"$f":"E96+E70","v":{"v":23.516571004618363,"d":"23.5"}},{"$f":"F96+F70","v":{"v":22.2521487854331,"d":"22.3"}},{"$f":"G96+G70","v":{"v":16.320431739778645,"d":"16.3"}},{"$f":"H96+H70","v":{"v":12.12607439271655,"d":"12.1"}},{"$f":"I96+I70","v":{"v":15.585554412400464,"d":"15.6"}},{"v":12.12607439271655,"d":"12.1"},{"v":6.528518137466821,"d":"6.5"},{"v":13.981332799382617,"d":"14.0"},{"v":12.12607439271655,"d":"12.1"},{"v":6.528518137466821,"d":"6.5"}]
[null,"Longitudinal Plating (b<s)"]
[null,"Plate Thickness Required to Resist Ice Load","mm","t_net",{"$f":"0.5*s*SQRT(AF*PPFpl*Pavg/Fy_p)*(2000*b/s-(1000*b/s)^2)^0.5/(1+s/(2000*a))","v":{"$error":"#NUM!"}},{"$error":"#NUM!"},{"$error":"#NUM!"},{"$error":"#NUM!"},{"$error":"#NUM!"},{"$error":"#NUM!"},{"$error":"#NUM!"},{"$error":"#NUM!"},{"$error":"#NUM!"},{"$error":"#NUM!"}]
[null,"Required Minimum Shell Plate Thickness","mm","t_min",{"$f":"E99+E70","v":{"$error":"#NUM!"}},{"$f":"F99+F70","v":{"$error":"#NUM!"}},{"$f":"G99+G70","v":{"$error":"#NUM!"}},{"$f":"H99+H70","v":{"$error":"#NUM!"}},{"$f":"I99+I70","v":{"$error":"#NUM!"}},{"$error":"#NUM!"},{"$error":"#NUM!"},{"$error":"#NUM!"},{"$error":"#NUM!"},{"$error":"#NUM!"}]
[]
[null,"Longitudinal Framing"]
[null,"Peak Pressure Factor - Transverse Frame"," -","PPFs",{"$f":"IF(a/1000<0.5*w,2-2*a/1000/w,1)","v":1},1,1,1,1,1,1,1,1,1]
[null,"Length of Loaded Portion of Span","m","b_1",{"$f":"ko*b_2","v":{"v":0.32450581504556536,"d":"0.325"}},{"$f":"ko*b_2","v":{"v":0.3266923258275502,"d":"0.327"}},{"v":0.3266923258275502,"d":"0.327"},{"v":0.3266923258275502,"d":"0.327"},{"v":0.3266923258275502,"d":"0.327"},{"v":0.3266923258275502,"d":"0.327"},{"v":0.3266923258275502,"d":"0.327"},{"v":0.3266923258275502,"d":"0.327"},{"v":0.3266923258275502,"d":"0.327"},{"v":0.3266923258275502,"d":"0.327"}]
[null,"load height parameter"," -","ko",{"$f":"1-0.3/bpri","v":{"v":0.8539626711725404,"d":"0.854"}},{"$f":"1-0.3/bpri","v":{"v":0.8597166469146058,"d":"0.860"}},{"v":0.8597166469146058,"d":"0.860"},{"v":0.8597166469146058,"d":"0.860"},{"v":0.8597166469146058,"d":"0.860"},{"v":0.8597166469146058,"d":"0.860"},{"v":0.8597166469146058,"d":"0.860"},{"v":0.8597166469146058,"d":"0.860"},{"v":0.8597166469146058,"d":"0.860"},{"v":0.8597166469146058,"d":"0.860"}]
[null,"load height parameter","m","b_2",{"$f":"IF(bpri<2,b*(1-0.25*bpri),s/1000)","v":{"v":0.38,"d":"0.380"}},{"v":0.38,"d":"0.380"},{"v":0.38,"d":"0.380"},{"v":0.38,"d":"0.380"},{"v":0.38,"d":"0.380"},{"v":0.38,"d":"0.380"},{"v":0.38,"d":"0.380"},{"v":0.38,"d":"0.380"},{"v":0.38,"d":"0.380"},{"v":0.38,"d":"0.380"}]
[null,"load height parameter"," -","bpri",{"$f":"b/s*1000","v":{"v":2.0542692913429317,"d":"2.054"}},{"$f":"b/s*1000","v":{"v":2.138528866054279,"d":"2.139"}},{"v":2.138528866054279,"d":"2.139"},{"v":2.138528866054279,"d":"2.139"},{"v":2.138528866054279,"d":"2.139"},{"v":2.138528866054279,"d":"2.139"},{"v":2.138528866054279,"d":"2.139"},{"v":2.138528866054279,"d":"2.139"},{"v":2.138528866054279,"d":"2.139"},{"v":2.138528866054279,"d":"2.139"}]
[null,"Required Shear Area of Longitudinal Frame","cm2","AL",{"$f":"100^2*(AF*PPFs*Pavg)*0.5*b_1*a/1000/(0.577*Fy_f)","v":{"v":49.58694450829699,"d":"49.6"}},{"$f":"100^2*(AF*PPFs*Pavg)*0.5*b_1*a/1000/(0.577*Fy_f)","v":{"v":44.226227352882255,"d":"44.2"}},{"v":22.113113676441127,"d":"22.1"},{"v":11.056556838220564,"d":"11.1"},{"v":19.901802308797016,"d":"19.9"},{"v":11.056556838220564,"d":"11.1"},{"v":2.2113113676441127,"d":"2.2"},{"v":15.47917957350879,"d":"15.5"},{"v":11.056556838220564,"d":"11.1"},{"v":2.2113113676441127,"d":"2.2"}]
[null,"Ratio of Minimum Shear Area / Fitted Shear Area",null,"a_4",{"$f":"E108/E54","v":{"v":1.2714601155973586,"d":"1.271"}},{"$f":"F108/F54","v":{"v":1.2150062459583038,"d":"1.215"}},{"$f":"G108/G54","v":{"v":1.116823923052582,"d":"1.117"}},{"$f":"H108/H54","v":{"v":0.877504510969886,"d":"0.878"}},{"$f":"I108/I54","v":{"v":1.190299181148147,"d":"1.190"}},{"v":0.877504510969886,"d":"0.878"},{"v":0.7457545419007531,"d":"0.746"},{"v":0.9674487233442993,"d":"0.967"},{"v":0.877504510969886,"d":"0.878"},{"v":0.4422622735288225,"d":"0.442"}]
[]
[null,"Shear Parameter"," -","kwl",{"$f":"1/(1+2*wf*tf/((hw+tf)*tw))","v":{"v":0.5365711570007206,"d":"0.537"}},{"v":0.5508093525179856,"d":"0.551"},{"v":0.5390729904829114,"d":"0.539"},{"v":0.5411499436302142,"d":"0.541"},{"v":0.4871794871794872,"d":"0.487"},{"v":0.5411499436302142,"d":"0.541"},{"v":0.3813612327287201,"d":"0.381"},{"v":0.5400086401382422,"d":"0.540"},{"v":0.5411499436302142,"d":"0.541"},{"v":0.5488423999048673,"d":"0.549"}]
[null,"Interaction Eq For 3H Mechanism (Sym Load)"," -","A4_",{"$f":"1/(2+kwl*((1-(IF(a_4>1,1,a_4))^2)^0.5-1))","v":{"v":0.6833266986528107,"d":"0.683"}},{"v":0.6900403350915296,"d":"0.690"},{"v":0.6844968937432071,"d":"0.684"},{"v":0.5819473667265446,"d":"0.582"},{"v":0.6610169491525424,"d":"0.661"},{"v":0.5819473667265446,"d":"0.582"},{"v":0.5339856344151374,"d":"0.534"},{"v":0.6263114210746973,"d":"0.626"},{"v":0.5819473667265446,"d":"0.582"},{"v":0.5145603766593974,"d":"0.515"}]
[null,"Required Plastic Section Modulus of Longitudinal Frame","cm3","ZpL",{"$f":"100^3*(AF*PPFs*Pavg)*b_1*(a/1000)^2*A4_/(8*Fy_f)*IF(a_4>1,1000,1)","v":{"v":977555.797063836,"d":"977555.8"}},{"$f":"100^3*(AF*PPFs*Pavg)*b_1*(a/1000)^2*A4_/(8*Fy_f)*IF(a_4>1,1000,1)","v":{"v":880440.8594187318,"d":"880440.9"}},{"v":436683.9174095399,"d":"436683.9"},{"v":185.63053985432023,"d":"185.6"},{"v":379534.1164024231,"d":"379534.1"},{"v":185.63053985432023,"d":"185.6"},{"v":34.06632532715343,"d":"34.1"},{"v":279.69460367352355,"d":"279.7"},{"v":185.63053985432023,"d":"185.6"},{"v":32.827065115601776,"d":"32.8"}]
[]
[null,"Required Plating"]
[null,"ratio",null,"angFac",{"$f":"IF(FO=\"Transverse\",0,IF(OA<20,1,(70-OA)/50))","v":{"v":0,"d":"0.00"}},{"v":0,"d":"0.00"},{"v":0,"d":"0.00"},{"v":0,"d":"0.00"},{"v":0,"d":"0.00"},{"v":0,"d":"0.00"},{"v":0,"d":"0.00"},{"v":0,"d":"0.00"},{"v":0,"d":"0.00"},{"v":0,"d":"0.00"}]
[null,"Plate Thickness Required to Resist Ice Load","mm","t_reqd",{"$f":"E75+angFac*(IF(b<s/1000,E99,E96)-E75)","v":{"v":17.098137451591956,"d":"17.1"}},{"$f":"F75+angFac*(F96-F75)","v":{"v":16.218453029030986,"d":"16.2"}},{"v":11.468178117183312,"d":"11.5"},{"v":8.109226514515493,"d":"8.1"},{"v":10.879669038840198,"d":"10.9"},{"v":8.109226514515493,"d":"8.1"},{"v":3.6265563462800654,"d":"3.6"},{"v":9.594966207820097,"d":"9.6"},{"v":8.109226514515493,"d":"8.1"},{"v":3.6265563462800654,"d":"3.6"}]
[null,"Required Minimum Shell Plate Thickness","mm","t_min",{"$f":"E117+E70","v":{"v":19.098137451591956,"d":"19.1"}},{"$f":"F117+F70","v":{"v":18.218453029030986,"d":"18.2"}},{"$f":"G117+G70","v":{"v":13.468178117183312,"d":"13.5"}},{"$f":"H117+H70","v":{"v":10.109226514515493,"d":"10.1"}},{"$f":"I117+I70","v":{"v":12.879669038840198,"d":"12.9"}},{"v":10.109226514515493,"d":"10.1"},{"v":5.626556346280065,"d":"5.6"},{"v":11.594966207820097,"d":"11.6"},{"v":10.109226514515493,"d":"10.1"},{"v":5.626556346280065,"d":"5.6"}]
[]
[null,"Required Framing"]
[null,"Required Shear Area of Between Frame","cm2","A_reqd",{"$f":"E81+angFac*(E108-E81)","v":{"v":32.18309303920928,"d":"32.2"}},{"$f":"F81+angFac*(F108-F81)","v":{"v":29.681211260864774,"d":"29.7"}},{"v":14.840605630432387,"d":"14.8"},{"v":7.420302815216194,"d":"7.4"},{"v":13.356545067389147,"d":"13.4"},{"v":7.420302815216194,"d":"7.4"},{"v":1.4840605630432389,"d":"1.5"},{"v":10.38842394130267,"d":"10.4"},{"v":7.420302815216194,"d":"7.4"},{"v":1.4840605630432389,"d":"1.5"}]
[null,"Required Plastic Section Modulus of Longitudinal Frame","cm3","Z_reqd",{"$f":"E92+angFac*(E113-E92)","v":{"v":912.8903769358043,"d":"912.9"}},{"v":773.5379403599375,"d":"773.5"},{"v":375.367866071689,"d":"375.4"},{"v":179.92148418481995,"d":"179.9"},{"v":340.0567897419982,"d":"340.1"},{"v":179.92148418481995,"d":"179.9"},{"v":35.01317045626234,"d":"35.0"},{"v":255.32491474521393,"d":"255.3"},{"v":179.92148418481995,"d":"179.9"},{"v":34.544001501288605,"d":"34.5"}]

{"sheet":"Bow Load Calcs","index":3,"n_rows":32,"n_cols":15,"rows_kept":32}
[]
[]
[null,"PC.design&check"]
[]
[]
[]
[]
[]
[null,"Vessel Particulars (Bow Area)","Item"]
[]
[]
[]
[null,"station of collision","Location",1,2,3,4]
[null,"Increment","x/L",{"$f":"O17","v":{"v":0.04978354978354978,"d":"0.0498"}},{"$f":"O18","v":{"v":0.10028860028860029,"d":"0.1003"}},{"$f":"O19","v":{"v":0.14935064935064932,"d":"0.1494"}},{"$f":"O20","v":{"v":0.19985569985569984,"d":"0.1999"}},{"$nulls":5},"user edit"]
[{"$nulls":11},"L",{"v":69.3,"d":"69.30"}]
[null,"waterline angle","alf",{"v":28.2,"d":"28.20"},{"v":22.8,"d":"22.80"},{"v":8.4,"d":"8.40"},{"v":0.1,"d":"0.10"},"user edit",{"$nulls":3},"Lb",{"v":22.2,"d":"22.20"},null,"x/L"]
[null,"frame angle","beta",{"v":45,"d":"45.00"},{"v":43,"d":"43.00"},{"v":13.6,"d":"13.60"},{"v":7.2,"d":"7.20"},"user edit",{"$nulls":4},1,{"$f":"69.3/2-31.2","v":3.4499999999999993},{"$f":"N17/M$15","v":0.04978354978354978}]
[null,"normal frame angle","betap",{"$f":"ATAN(TAN(D17*deg)*COS(D16*deg))/deg","v":{"v":41.38983878557452,"d":"41.39"}},{"$f":"ATAN(TAN(E17*deg)*COS(E16*deg))/deg","v":{"v":40.684044088510504,"d":"40.68"}},{"$f":"ATAN(TAN(F17*deg)*COS(F16*deg))/deg","v":{"v":13.45943927714776,"d":"13.46"}},{"$f":"ATAN(TAN(G17*deg)*COS(G16*deg))/deg","v":{"v":7.199989148859127,"d":"7.20"}},{"$nulls":5},3,{"$f":"69.3/2-27.7","v":6.949999999999999},{"$f":"N18/M$15","v":0.10028860028860029}]
[{"$nulls":12},5,{"$f":"69.3/2-24.3","v":10.349999999999998},{"$f":"N19/M$15","v":0.14935064935064932}]
[null,"shape factor 5.1a","fa_a",{"$f":"(0.097-0.68*(D14-0.15)^2)*D16/SQRT(D18)","v":{"v":0.39524543958382585,"d":"0.395"}},{"$f":"(0.097-0.68*(E14-0.15)^2)*E16/SQRT(E18)","v":{"v":0.3407256707026042,"d":"0.341"}},{"$f":"(0.097-0.68*(F14-0.15)^2)*F16/SQRT(F18)","v":{"v":0.22209370689941163,"d":"0.222"}},{"$f":"(0.097-0.68*(G14-0.15)^2)*G16/SQRT(G18)","v":{"v":3.5519891401057098E-3,"d":"0.004"}},null,"do not edit other values",{"$nulls":3},7,{"$f":"69.3/2-20.8","v":13.849999999999998},{"$f":"N20/M$15","v":0.19985569985569984}]
[null,"shape factor 5.1b","fa_b",{"$f":"(1.2*CFf)/(SIN(D18*deg)*CFc*Disp^0.64)","v":{"v":0.3347919718225111,"d":"0.33"}},{"$f":"(1.2*CFf)/(SIN(E18*deg)*CFc*Disp^0.64)","v":{"v":0.33956387754404677,"d":"0.34"}},{"$f":"(1.2*CFf)/(SIN(F18*deg)*CFc*Disp^0.64)","v":{"v":0.9510236553404653,"d":"0.95"}},{"$f":"(1.2*CFf)/(SIN(G18*deg)*CFc*Disp^0.64)","v":{"v":1.766153223574827,"d":"1.77"}}]
[null,"shape factor 5.1c","fa_c",{"v":0.6,"d":"0.60"},{"v":0.6,"d":"0.60"},{"v":0.6,"d":"0.60"},{"v":0.6,"d":"0.60"}]
[null,"shape factor","fa",{"$f":"MAX(MIN(D20,D21,D22),0.001)","v":{"v":0.3347919718225111,"d":"0.335"}},{"$f":"MAX(MIN(E20,E21,E22),0.001)","v":{"v":0.33956387754404677,"d":"0.340"}},{"$f":"MAX(MIN(F20,F21,F22),0.001)","v":{"v":0.22209370689941163,"d":"0.222"}},{"$f":"MAX(MIN(G20,G21,G22),0.001)","v":{"v":3.5519891401057098E-3,"d":"0.004"}},{"$nulls":4},"B",18,{"$f":"M$16/8*M23","v":49.949999999999996},{"$f":"N23/M$15","v":0.7207792207792207}]
[null,"Design Ice Load Particulars"]
[null,"Force (MN)","F",{"$f":"fa*CFc*Disp^0.64","v":{"v":7.368657031967417,"d":"7.369"}},{"$f":"fa*CFc*Disp^0.64","v":{"v":7.473685048199302,"d":"7.474"}},{"$f":"fa*CFc*Disp^0.64","v":{"v":4.8882066860541755,"d":"4.888"}},{"$f":"fa*CFc*Disp^0.64","v":{"v":0.0781780686443329,"d":"0.078"}},{"$f":"MAX(D25:G25)","v":{"v":7.473685048199302,"d":"7.474"}},{"$nulls":3},",04 L",{"$f":"0.04*M15","v":2.772}]
[null,"Aspect Ratio","AR",{"$f":"MAX(7.46*SIN(betap*deg),1.3)","v":{"v":4.932394036297807,"d":"4.932"}},{"$f":"MAX(7.46*SIN(betap*deg),1.3)","v":{"v":4.86307889155122,"d":"4.863"}},{"$f":"MAX(7.46*SIN(betap*deg),1.3)","v":{"v":1.7363668253094764,"d":"1.736"}},{"$f":"MAX(7.46*SIN(betap*deg),1.3)","v":{"v":1.3,"d":"1.300"}},{"$f":"MAX(D26:G26)","v":{"v":4.932394036297807,"d":"4.932"}},{"$nulls":3},",15 L",{"$f":"0.15*M15","v":10.395}]
[null,"Line load (MN/m)","Q",{"$f":"D25^0.61*CFd*(1/D26)^0.35","v":{"v":2.1471364800214614,"d":"2.147"}},{"$f":"E25^0.61*CFd*(1/E26)^0.35","v":{"v":2.1765078693523714,"d":"2.177"}},{"$f":"F25^0.61*CFd*(1/F26)^0.35","v":{"v":2.408960577934883,"d":"2.409"}},{"$f":"G25^0.61*CFd*(1/G26)^0.35","v":{"v":0.2139068129722675,"d":"0.214"}},{"$f":"MAX(D27:G27)","v":{"v":2.408960577934883,"d":"2.409"}},{"$nulls":3},".7 B",{"$f":"0.7*M23","v":12.6}]
[null,"Pressure (Mpa)","P",{"$f":"D25^0.22*CFd^2*(D26)^0.3","v":{"v":3.0859488425637154,"d":"3.086"}},{"$f":"E25^0.22*CFd^2*(E26)^0.3","v":{"v":3.082456853740856,"d":"3.082"}},{"$f":"F25^0.22*CFd^2*(F26)^0.3","v":{"v":2.061347945878892,"d":"2.061"}},{"$f":"G25^0.22*CFd^2*(G26)^0.3","v":{"v":0.7608650745435155,"d":"0.761"}},{"$f":"MAX(D28:G28)","v":{"v":3.0859488425637154,"d":"3.086"}}]
[null,"Load Patch Width (m)","w",{"$f":"D25/D27","v":{"v":3.4318531218349775,"d":"3.432"}},{"$f":"E25/E27","v":{"v":3.4337964743601535,"d":"3.434"}},{"$f":"F25/F27","v":{"v":2.0291767041886017,"d":"2.029"}},{"$f":"G25/G27","v":{"v":0.36547722607820116,"d":"0.365"}},{"$f":"Fmax/Qmax","v":{"v":3.102452201441266,"d":"3.102"}}]
[null,"Load Patch Height (m)","b",{"$f":"D27/D28","v":{"v":0.6957783779194744,"d":"0.696"}},{"$f":"E27/E28","v":{"v":0.7060951613032219,"d":"0.706"}},{"$f":"F27/F28","v":{"v":1.1686336519513596,"d":"1.169"}},{"$f":"G27/G28","v":{"v":0.2811363277524624,"d":"0.281"}},{"$f":"Qmax/Pmax","v":{"v":0.780622330710314,"d":"0.781"}}]
[]
[null,null,"deg",{"$f":"PI()/180","v":0.017453292519943295}]

{"sheet":"Class Factors","index":4,"n_rows":56,"n_cols":24,"rows_kept":56}
[]
[]
[null,"PC.design&check"]
[{"$nulls":9},"no user editable values on this sheet"]
[null,"Tabular Data for IACS Polar Rules"]
[]
[null,"class_tab"]
[null,"Class","Cfdis","CFc","CFf","CFd","CFb"]
[null,null,"kT",{"$nulls":5},"OK"]
[null,{"v":1,"d":"PC 1"},250,17.69,{"v":68.6,"d":"68.60"},2.01,{"v":33,"d":"33.00"}]
[null,{"v":2,"d":"PC 2"},210,9.89,{"v":46.8,"d":"46.80"},1.75,{"v":18,"d":"18.00"}]
[null,{"v":3,"d":"PC 3"},180,6.06,21.17,1.53,{"v":10,"d":"10.00"}]
[null,{"v":4,"d":"PC 4"},130,{"v":4.5,"d":"4.50"},13.48,1.42,{"v":6.9,"d":"6.90"}]
[null,{"v":5,"d":"PC 5"},70,{"v":3.1,"d":"3.10"},{"v":9,"d":"9.00"},1.31,{"v":4.6,"d":"4.60"}]
[null,{"v":6,"d":"PC 6"},40,{"v":2.4,"d":"2.40"},5.49,1.17,{"v":3.4,"d":"3.40"}]
[null,{"v":7,"d":"PC 7"},22,{"v":1.8,"d":"1.80"},4.06,1.11,{"v":2.6,"d":"2.60"}]
[null,{"v":8,"d":"PC 8"},{"$f":"T40","v":4},{"$f":"U40","v":{"v":1,"d":"1.00"}},{"$f":"V40","v":{"v":2.4,"d":"2.40"}},{"$f":"W40","v":{"v":1,"d":"1.00"}},{"v":1.3851094681109246,"d":"1.39"}]
[]
[null,"HAF_tab_r",{"$nulls":12},"Class","Vs","Po","h_ice","sig_f","Cfdis","CFc","CFf","CFd","CFb"]
[null,"Hull Area Factors","Area of Ice Strength",{"$nulls":12},"m/s","Mpa","m","Mpa","kT"]
[null,"Area /","Bi","BIi","BIl","BIb","Mi","Ml","Mb","Si","Sl","Sb",null,"OK",{"v":1,"d":"PC 1"},{"v":5.7,"d":"5.70"},{"v":6,"d":"6.000"},{"v":7,"d":"7.0"},{"v":1.4,"d":"1.40"},250,17.69,{"v":68.6,"d":"68.60"},2.01,{"$f":"P21^0.94*Q21^0.53*R21^0.47","v":{"v":33.12368194241084,"d":"33.1"}}]
[null,"Ice Class",2,3,4,5,6,7,8,9,10,11,null,null,{"v":2,"d":"PC 2"},{"v":4,"d":"4.00"},{"v":4.2,"d":"4.200"},{"v":6,"d":"6.0"},{"v":1.3,"d":"1.30"},210,9.89,{"v":46.8,"d":"46.80"},1.75,{"$f":"P22^0.94*Q22^0.53*R22^0.47","v":{"v":18.28056453838988,"d":"18.3"}}]
[null,{"v":1,"d":"PC 1"},1,0.9,0.7,0.55,0.7,0.5,0.3,0.75,0.45,0.35,null,null,{"v":3,"d":"PC 3"},{"v":3,"d":"3.00"},{"v":3,"d":"3.000"},{"v":4.25,"d":"4.3"},{"v":1.2,"d":"1.20"},180,6.06,21.17,1.53,{"v":9.924554970485925,"d":"9.9"}]
[null,{"v":2,"d":"PC 2"},1,0.85,0.65,0.5,0.65,0.45,0.3,0.7,0.4,0.3,null,null,{"v":4,"d":"PC 4"},{"v":2.5,"d":"2.50"},{"v":2.45,"d":"2.450"},3.5,{"v":1.1,"d":"1.10"},130,{"v":4.5,"d":"4.50"},13.48,1.42,{"v":6.8554128421605665,"d":"6.9"}]
[null,{"v":3,"d":"PC 3"},1,0.85,0.65,0.45,0.55,0.4,0.25,0.65,0.35,0.3,null,null,{"v":5,"d":"PC 5"},{"v":2,"d":"2.00"},{"v":2,"d":"2.000"},{"v":3,"d":"3.0"},{"v":1,"d":"1.00"},70,{"v":3.1,"d":"3.10"},{"v":9,"d":"9.00"},1.31,{"v":4.642598036022404,"d":"4.6"}]
[null,{"v":4,"d":"PC 4"},1,0.8,0.6,0.4,0.55,0.35,0.05,0.6,0.3,0.25,null,null,{"v":6,"d":"PC 6"},1.75,{"v":1.5,"d":"1.500"},2.8,{"v":0.7,"d":"0.70"},40,{"v":2.4,"d":"2.40"},5.49,1.17,{"v":3.403677531618495,"d":"3.4"}]
[null,{"v":5,"d":"PC 5"},1,0.8,0.55,0.35,0.5,0.3,0.05,0.5,0.25,0.15,null,null,{"v":7,"d":"PC 7"},{"v":1.5,"d":"1.50"},{"v":1.3,"d":"1.300"},2.5,0.65,22,{"v":1.8,"d":"1.80"},4.06,1.11,{"v":2.5879004393077993,"d":"2.6"}]
[null,{"v":6,"d":"PC 6"},1,1,0.55,0.3,0.45,0.25,0.05,0.4,0.25,0.05]
[null,{"v":7,"d":"PC 7"},1,1,0.5,0.25,0.45,0.25,0.05,0.35,0.25,0.05]
[null,{"v":8,"d":"PC 8"},1,1,0.5,0.25,0.45,0.25,0.05,0.35,0.25,0.05]
[{"$nulls":14},"Class","Vs","Po","h_ice","sig_f","Cfdis","CFc","CFf","CFd"]
[null,"WA_coat_tab",{"$nulls":13},"m/s","Mpa","m","Mpa","kT"]
[null,"WA coating","Area of Ice Strength",{"$nulls":11},{"v":1,"d":"PC 1"},{"v":5.7,"d":"5.700"},{"v":6,"d":"6.000"},{"v":7,"d":"7.0"},{"v":1.4,"d":"1.40"},250,{"$f":"Q33^0.36*P33^1.28","v":{"v":17.687003648214542,"d":"17.687"}},{"$f":"S33*R33^2","v":68.6},{"$f":"Q33^0.39","v":{"v":2.0113098831942757,"d":"2.011"}}]
[null,null,"Bi","BIi","BIl","BIb","Mi","Ml","Mb","Si","Sl","Sb",null,null,{"v":2,"d":"PC 2"},{"v":4,"d":"4.000"},{"v":4.2,"d":"4.200"},{"v":6,"d":"6.0"},{"v":1.3,"d":"1.30"},210,{"v":9.885679663722906,"d":"9.886"},{"v":46.800000000000004,"d":"46.8"},{"v":1.7501175635717086,"d":"1.750"}]
[null,"Ice Class",2,3,4,5,6,7,8,9,10,11,null,null,{"v":3,"d":"PC 3"},{"v":3,"d":"3.000"},{"v":3,"d":"3.000"},{"v":5,"d":"5.0"},{"v":1.2,"d":"1.20"},180,{"v":6.060086981831168,"d":"6.060"},{"v":30,"d":"30.0"},{"v":1.5348901156493253,"d":"1.535"}]
[null,{"v":1,"d":"PC 1"},3.5,3.5,2.5,2,2.5,2,2,2.5,2,2,null,null,{"v":4,"d":"PC 4"},{"v":2.5,"d":"2.500"},{"v":2.45,"d":"2.450"},{"v":4,"d":"4.0"},{"v":1.1,"d":"1.10"},130,{"v":4.461316160011992,"d":"4.461"},17.6,{"v":1.4183217827855343,"d":"1.418"}]
[null,{"v":2,"d":"PC 2"},3.5,3.5,2.5,2,2.5,2,2,2.5,2,2,null,null,{"v":5,"d":"PC 5"},{"v":2,"d":"2.000"},{"v":2,"d":"2.000"},{"v":3,"d":"3.0"},{"v":1,"d":"1.00"},70,{"v":3.116658318642,"d":"3.117"},{"v":9,"d":"9.0"},{"v":1.3103934038583633,"d":"1.310"}]
[null,{"v":3,"d":"PC 3"},3.5,3.5,2.5,2,2.5,2,2,2.5,2,2,null,null,{"v":6,"d":"PC 6"},{"v":1.75,"d":"1.750"},{"v":1.5,"d":"1.500"},2.8,{"v":0.7,"d":"0.70"},40,{"v":2.368544537916832,"d":"2.369"},{"v":5.487999999999999,"d":"5.5"},{"v":1.17132008687616,"d":"1.171"}]
[null,{"v":4,"d":"PC 4"},2.5,2.5,2,2,2,2,2,2,2,2,null,null,{"v":7,"d":"PC 7"},{"v":1.5,"d":"1.500"},{"v":1.3,"d":"1.300"},2.5,0.65,22,{"v":1.8467853400416838,"d":"1.847"},{"v":4.0625,"d":"4.1"},{"v":1.1077401765662502,"d":"1.108"}]
[null,{"v":5,"d":"PC 5"},2.5,2.5,2,2,2,2,2,2,2,2,null,null,{"v":8,"d":"PC 8"},{"v":1,"d":"1.000"},{"v":1,"d":"1.000"},{"v":2,"d":"2.0"},{"v":0.6,"d":"0.60"},4,{"$f":"Q40^0.36*P40^1.28","v":{"v":1,"d":"1.000"}},{"$f":"S40*R40^2","v":2.4},{"$f":"Q40^0.39","v":{"v":1,"d":"1.000"}},{"$f":"P40^0.94*Q40^0.53*R40^0.47","v":{"v":1.3851094681109246,"d":"1.4"}}]
[null,{"v":6,"d":"PC 6"},2,2,2,2,2,2,2,2,2,2]
[null,{"v":7,"d":"PC 7"},2,2,2,2,2,2,2,2,2,2]
[null,{"v":8,"d":"PC 8"},2,2,2,2,2,2,2,2,2,2]
[]
[null,"WA_nocoat_tab"]
[null,"WA no coating","Area of Ice Strength"]
[null,null,"Bi","BIi","BIl","BIb","Mi","Ml","Mb","Si","Sl","Sb"]
[null,"Ice Class",2,3,4,5,6,7,8,9,10,11]
[null,{"v":1,"d":"PC 1"},7,7,5,4,5,4,4,5,4,4]
[null,{"v":2,"d":"PC 2"},7,7,5,4,5,4,4,5,4,4]
[null,{"v":3,"d":"PC 3"},7,7,5,4,5,4,4,5,4,4]
[null,{"v":4,"d":"PC 4"},5,5,4,3,4,3,3,4,3,3]
[null,{"v":5,"d":"PC 5"},5,5,4,3,4,3,3,4,3,3]
[null,{"v":6,"d":"PC 6"},4,4,3,2.5,3,2.5,2.5,3,2.5,2.5]
[null,{"v":7,"d":"PC 7"},4,4,3,2.5,3,2.5,2.5,3,2.5,2.5]
[null,{"v":8,"d":"PC 8"},4,4,3,2.5,3,2.5,2.5,3,2.5,2.5]

{"sheet":"bulbs","index":5,"n_rows":81,"n_cols":19,"rows_kept":81}
[null,null,"Bulb Dimensions",{"$nulls":5},"Converted to T or L"]
[null,null,"hw","tw","bf",null,"A","e","hw","tw","wf","tf",null,"W","I",null,"tf","A","e_appr"]
[{"$nulls":8},"mm","mm","mm","mm"]
["HP","HP 60*4.0",60,4,17,null,3.5,38.2,50.38,4,17,9.62,null,10.1,49,null,9.62,365.06,{"v":38.62943461348819,"d":"38.63"}]
["HP","HP 60*5.0",60,5,18,null,4.1,37,50.38,5,18,9.62,null,11.6,61,null,9.62,425.06,{"v":37.411333458805814,"d":"37.41"}]
["HP","HP 60*6.0",60,6,19,null,4.7,36.2,50.38,6,19,9.62,null,13.2,72,null,9.62,485.06,{"v":36.494580876592586,"d":"36.49"}]
["HP","HP 80*5.0",80,5,19,null,5.4,48.9,69.64,5,19,10.36,null,19.7,127,null,10.36,545.04,{"v":49.26591222662557,"d":"49.27"}]
["HP","HP 80*6.0",80,6,20,null,6.2,47.8,69.64,6,20,10.36,null,22.3,151,null,10.36,625.04,{"v":48.07995136311276,"d":"48.08"}]
["HP","HP 80*7.0",80,7,21,null,7,46.9,69.64,7,21,10.36,null,24.9,175,null,10.36,705.04,{"v":47.16312946783162,"d":"47.16"}]
["HP","HP 100*6.0",100,6,21.5,null,7.7,59.8,88.53,6,21.5,11.47,null,33.9,275,null,11.47,{"v":777.7850000000001,"d":"777.79"},{"v":60.118031364708756,"d":"60.12"}]
["HP","HP 100*7.0",100,7,22.5,null,8.7,58.7,88.53,7,22.5,11.47,null,37.9,320,null,11.47,{"v":877.7850000000001,"d":"877.79"},{"v":58.965353731266774,"d":"58.97"}]
["HP","HP 120*6.0",120,6,23,null,9.3,72,107.42,6,23,12.58,null,48.2,451,null,12.58,{"v":933.8599999999999,"d":"933.86"},{"v":72.29993853468399,"d":"72.30"}]
["HP","HP 100*8.0",100,8,23.5,null,9.7,57.8,88.53,8,23.5,11.47,null,42,365,null,11.47,{"v":977.7850000000001,"d":"977.79"},{"v":58.048449326794746,"d":"58.05"}]
["HP","HP 120*7.0",120,7,24,null,10.5,70.7,107.42,7,24,12.58,null,53.8,525,null,12.58,{"v":1053.8600000000001,"d":"1053.86"},{"v":70.89937999354753,"d":"70.90"}]
["HP","HP 140*6.0",140,6,25,null,11,84.8,125.94,6,25,14.06,null,66.3,700,null,14.06,{"v":1107.1399999999999,"d":"1107.14"},{"v":85.19392831981502,"d":"85.19"}]
["HP","HP 120*8.0",120,8,25,null,11.7,69.6,107.42,8,25,12.58,null,59.5,600,null,12.58,{"v":1173.8600000000001,"d":"1173.86"},{"v":69.78517080401409,"d":"69.79"}]
["HP","HP 140*7.0",140,7,26,null,12.4,83.1,125.94,7,26,14.06,null,73.8,817,null,14.06,{"v":1247.1399999999999,"d":"1247.14"},{"v":83.48830588386228,"d":"83.49"}]
["HP","HP 140*8.0",140,8,27,null,13.8,81.8,125.94,8,27,14.06,null,81.3,921,null,14.06,{"v":1387.1399999999999,"d":"1387.14"},{"v":82.1269704571997,"d":"82.13"}]
["HP","HP 160*7.0",160,7,29,null,14.6,96.6,143.72,7,29,16.28,null,100.1,1212,null,16.28,{"v":1478.1599999999999,"d":"1478.16"},{"v":97.41176706175246,"d":"97.41"}]
["HP","HP 140*9.0",140,9,28,null,15.2,80.7,125.94,9,28,14.06,null,89,1044,null,14.06,1527.14,{"v":81.01523488350773,"d":"81.02"}]
["HP","HP 160*8.0",160,8,30,null,16.2,94.9,143.72,8,30,16.28,null,109.9,1383,null,16.28,1638.16,{"v":95.71115007081114,"d":"95.71"}]
["HP","HP 160*9.0",160,9,31,null,17.8,93.6,143.72,9,31,16.28,null,119.8,1556,null,16.28,1798.16,{"v":94.31317435600837,"d":"94.31"}]
["HP","HP 180*8.0",180,8,33,null,18.8,108.8,161.5,8,33,18.5,null,146.2,1999,null,18.5,{"v":1902.5,"d":"1902.50"},{"v":109.63042049934297,"d":"109.63"}]
["HP","HP 180*9.0",180,9,34,null,20.6,107.2,161.5,9,34,18.5,null,158.6,2235,null,18.5,{"v":2082.5,"d":"2082.50"},{"v":107.93367346938776,"d":"107.93"}]
["HP","HP 180*10.0",180,10,35,null,22.4,105.8,161.5,10,35,18.5,null,171.1,2495,null,18.5,{"v":2262.5,"d":"2262.50"},{"v":106.50690607734806,"d":"106.51"}]
["HP","HP 200*9.0",200,9,37,null,23.6,121.1,179.28,9,37,20.72,null,204.4,3094,null,20.72,2380.16,{"v":121.84959935466526,"d":"121.85"}]
["HP","HP 180*11.0",180,11,36,null,24.2,104.6,161.5,11,36,18.5,null,183.6,2750,null,18.5,{"v":2442.5,"d":"2442.50"},{"v":105.29042988741044,"d":"105.29"}]
["HP","HP 200*10.0",200,10,38,null,25.6,119.5,179.28,10,38,20.72,null,219.8,3423,null,20.72,2580.16,{"v":120.15593699615528,"d":"120.16"}]
["HP","HP 200*11.0",200,11,39,null,27.6,118.1,179.28,11,39,20.72,null,235.2,3773,null,20.72,2780.16,{"v":118.70595303867402,"d":"118.71"}]
["HP","HP 200*11.5",200,11.5,39.5,null,28.6,117.4,179.28,11.5,39.5,20.72,null,243,3947,null,20.72,2880.16,{"v":118.05647686239654,"d":"118.06"}]
["HP","HP 220*10.0",220,10,41,null,28.9,133.4,197.06,10,41,22.94,null,276.4,4652,null,22.94,2911.14,{"v":134.06913587117074,"d":"134.07"}]
["HP","HP 200*12.0",200,12,40,null,29.6,116.8,179.28,12,40,20.72,null,250.8,4122,null,20.72,2980.16,{"v":117.45058735101473,"d":"117.45"}]
["HP","HP 220*11.0",220,11,42,null,31.1,131.7,197.06,11,42,22.94,null,295,5095,null,22.94,3131.14,{"v":132.3779914663669,"d":"132.38"}]
["HP","HP 220*11.5",220,11.5,42.5,null,32.2,131,197.06,11.5,42.5,22.94,null,304.4,5317,null,22.94,{"v":3241.1400000000003,"d":"3241.14"},{"v":131.61851206674194,"d":"131.62"}]
["HP","HP 240*10.0",240,10,44,null,32.4,147.6,214.84,10,44,25.16,null,341.4,5999,null,25.16,3255.44,{"v":148.22701840611407,"d":"148.23"}]
["HP","HP 220*12.0",220,12,43,null,33.3,130.3,197.06,12,43,22.94,null,313.7,5539,null,22.94,{"v":3351.1400000000003,"d":"3351.14"},{"v":130.9088919591542,"d":"130.91"}]
["HP","HP 240*11.0",240,11,45,null,34.8,145.7,214.84,11,45,25.16,null,363.5,6659,null,25.16,{"v":3495.4400000000005,"d":"3495.44"},{"v":146.28892637264548,"d":"146.29"}]
["HP","HP 260*10.0",260,10,47,null,36,162,232.62,10,47,27.38,null,415.2,7746,null,27.38,{"v":3613.0599999999995,"d":"3613.06"},{"v":162.61197118232192,"d":"162.61"}]
["HP","HP 240*12.0",240,12,46,null,37.2,144,214.84,12,46,25.16,null,385.7,7231,null,25.16,{"v":3735.4399999999996,"d":"3735.44"},{"v":144.59987706936798,"d":"144.60"}]
["HP","HP 260*11.0",260,11,48,null,38.6,159.8,232.62,11,48,27.38,null,441.2,8505,null,27.38,{"v":3873.0600000000004,"d":"3873.06"},{"v":160.42271707642018,"d":"160.42"}]
["HP","HP 260*12.0",260,12,49,null,41.2,157.9,232.62,12,49,27.38,null,467.2,9246,null,27.38,{"v":4133.0599999999995,"d":"4133.06"},{"v":158.50890347587503,"d":"158.51"}]
["HP","HP 280*11.0",280,11,51,null,42.6,174.2,250.4,11,51,29.6,null,528.5,10635,null,29.6,{"v":4264,"d":"4264.00"},{"v":174.76472795497187,"d":"174.76"}]
["HP","HP 260*13.0",260,13,50,null,43.8,156.3,232.62,13,50,27.38,null,493.3,9978,null,27.38,{"v":4393.0599999999995,"d":"4393.06"},{"v":156.82162515422053,"d":"156.82"}]
["HP","HP 280*12.0",280,12,52,null,45.4,172.1,250.4,12,52,29.6,null,558.8,11611,null,29.6,{"v":4544,"d":"4544.00"},{"v":172.6225352112676,"d":"172.62"}]
["HP","HP 300*11.0",300,11,54,null,46.7,188.8,268.18,11,54,31.82,null,625.9,13186,null,31.82,4668.26,{"v":189.30157776130721,"d":"189.30"}]
["HP","HP 280*13.0",280,13,53,null,48.2,170.2,250.4,13,53,29.6,null,589,12546,null,29.6,{"v":4824,"d":"4824.00"},{"v":170.72902155887232,"d":"170.73"}]
["HP","HP 300*12.0",300,12,55,null,49.7,186.4,268.18,12,55,31.82,null,660.7,14405,null,31.82,4968.26,{"v":186.92841827923658,"d":"186.93"}]
["HP","HP 280*14.0",280,14,54,null,51,168.6,250.4,14,54,29.6,null,619.3,13497,null,29.6,{"v":5104,"d":"5104.00"},{"v":169.04326018808777,"d":"169.04"}]
["HP","HP 300*13.0",300,13,56,null,52.7,184.3,268.18,13,56,31.82,null,695.5,15601,null,31.82,5268.26,{"v":184.82553697046083,"d":"184.83"}]
["HP","HP 320*12.0",320,12,58,null,54.1,200.9,285.96,12,58,34.04,null,773.6,17502,null,34.04,{"v":5405.839999999999,"d":"5405.84"},{"v":201.41517381202553,"d":"201.42"}]
["HP","HP 300*14.0",300,14,57,null,55.7,182.5,268.18,14,57,31.82,null,730.2,16761,null,31.82,5568.26,{"v":182.94924867014112,"d":"182.95"}]
["HP","HP 320*13.0",320,13,59,null,57.3,198.6,285.96,13,59,34.04,null,813.2,18969,null,34.04,{"v":5725.839999999999,"d":"5725.84"},{"v":199.1006041384321,"d":"199.10"}]
["HP","HP 300*15.0",300,15,58,null,58.7,180.8,268.18,15,58,31.82,null,765.1,17930,null,31.82,5868.26,{"v":181.26480138916813,"d":"181.26"}]
["HP","HP 340*12.0",340,12,61,null,58.7,215.6,303.74,12,61,36.26,null,897.9,20978,null,36.26,5856.74,{"v":216.0723036706427,"d":"216.07"}]
["HP","HP 320*14.0",320,14,60,null,60.5,196.6,285.96,14,60,34.04,null,852.8,20420,null,34.04,{"v":6045.839999999999,"d":"6045.84"},{"v":197.0310499781668,"d":"197.03"}]
["HP","HP 340*13.0",340,13,62,null,62.1,213.1,303.74,13,62,36.26,null,942.7,22777,null,36.26,6196.74,{"v":213.54442881256918,"d":"213.54"}]
["HP","HP 320*15.0",320,15,61,null,63.7,194.8,285.96,15,61,34.04,null,892.4,21820,null,34.04,6365.84,{"v":195.16956178603292,"d":"195.17"}]
["HP","HP 340*14.0",340,14,63,null,65.5,210.9,303.74,14,63,36.26,null,987.5,24512,null,36.26,6536.74,{"v":211.27952217772162,"d":"211.28"}]
["HP","HP 320*16.0",320,16,62,null,66.9,193.1,285.96,16,62,34.04,null,932.1,23238,null,34.04,6685.84,{"v":193.48626398477975,"d":"193.49"}]
["HP","HP 340*15.0",340,15,64,null,68.9,208.9,303.74,15,64,36.26,null,1032.2,26229,null,36.26,6876.74,{"v":209.2385787160777,"d":"209.24"}]
["HP","HP 370*13.0",370,13,66.5,null,69.5,235.1,330.41,13,66.5,39.589999999999996,null,1160,29480,null,39.589999999999996,{"v":6928.065,"d":"6928.07"},{"v":235.50687721968544,"d":"235.51"}]
["HP","HP 340*16.0",340,16,65,null,72.3,207,303.74,16,65,36.26,null,1076.9,27909,null,36.26,7216.74,{"v":207.38994390819124,"d":"207.39"}]
["HP","HP 370*14.0",370,14,67.5,null,73.2,232.6,330.41,14,67.5,39.589999999999996,null,1213.2,31631,null,39.589999999999996,{"v":7298.0650000000005,"d":"7298.07"},{"v":232.94626086846307,"d":"232.95"}]
["HP","HP 370*15.0",370,15,68.5,null,76.9,230.3,330.41,15,68.5,39.589999999999996,null,1266.3,33914,null,39.589999999999996,{"v":7668.0650000000005,"d":"7668.07"},{"v":230.63275458997805,"d":"230.63"}]
["HP","HP 370*16.0",370,16,69.5,null,80.6,228.2,330.41,16,69.5,39.589999999999996,null,1319.3,36139,null,39.589999999999996,{"v":8038.0650000000005,"d":"8038.07"},{"v":228.53223422863587,"d":"228.53"}]
["HP","HP 400*14.0",400,14,72,null,81.2,254.6,357.08,14,72,42.92,null,1468.7,40356,null,42.92,{"v":8089.360000000001,"d":"8089.36"},{"v":254.9425831462563,"d":"254.94"}]
["HP","HP 370*17.0",370,17,70.5,null,84.3,226.3,330.41,17,70.5,39.589999999999996,null,1372.3,38324,null,39.589999999999996,{"v":8408.065,"d":"8408.07"},{"v":226.61658221303,"d":"226.62"}]
["HP","HP 400*15.0",400,15,73,null,85.2,252.1,357.08,15,73,42.92,null,1530.9,43105,null,42.92,8489.36,{"v":252.35380928597678,"d":"252.35"}]
["HP","HP 370*18.0",370,18,71.5,null,88,224.6,330.41,18,71.5,39.589999999999996,null,1425.4,40458,null,39.589999999999996,{"v":8778.065,"d":"8778.07"},{"v":224.86242165272188,"d":"224.86"}]
["HP","HP 400*16.0",400,16,74,null,89.2,249.7,357.08,16,74,42.92,null,1593.1,46013,null,42.92,8889.36,{"v":249.99801272532554,"d":"250.00"}]
["HP","HP 400*17.0",400,17,75,null,93.2,247.6,357.08,17,75,42.92,null,1655.1,48602,null,42.92,9289.36,{"v":247.84509744481858,"d":"247.85"}]
["HP","HP 430*15.0",430,15,77.5,null,93.9,274.1,383.75,15,77.5,46.25,null,1827.7,53730,null,46.25,{"v":9340.625,"d":"9340.63"},{"v":274.3791820006691,"d":"274.38"}]
["HP","HP 400*18.0",400,18,76,null,97.2,245.6,357.08,18,76,42.92,null,1717.1,51381,null,42.92,9689.36,{"v":245.86993716819273,"d":"245.87"}]
["HP","HP 430*16.0",430,16,78.5,null,98.2,271.5,383.75,16,78.5,46.25,null,1899.8,57149,null,46.25,{"v":9770.625,"d":"9770.63"},{"v":271.76593584084947,"d":"271.77"}]
["HP","HP 400*19.0",400,19,77,null,101.2,243.8,357.08,19,77,42.92,null,1779.2,54103,null,42.92,10089.36,{"v":244.0513902170207,"d":"244.05"}]
["HP","HP 430*17.0",430,17,79.5,null,102.5,269.2,383.75,17,79.5,46.25,null,1971.7,60832,null,46.25,{"v":10200.625,"d":"10200.63"},{"v":269.37300870044726,"d":"269.37"}]
["HP","HP 430*18.0",430,18,80.5,null,106.8,267,383.75,18,80.5,46.25,null,2043.5,64325,null,46.25,{"v":10630.625,"d":"10630.63"},{"v":267.1736654124287,"d":"267.17"}]
["HP","HP 430*19.0",430,19,81.5,null,111.1,265,383.75,19,81.5,46.25,null,2115.2,67752,null,46.25,{"v":11060.625,"d":"11060.63"},{"v":265.14532830423235,"d":"265.15"}]
["HP","HP 430*20.0",430,20,82.5,null,115.4,263.1,383.75,20,82.5,46.25,null,2187,71353,null,46.25,{"v":11490.625,"d":"11490.63"},{"v":263.2687992929018,"d":"263.27"}]
["HP","HP 430*21.0",430,21,83.5,null,119.7,261.4,383.75,21,83.5,46.25,null,2258.8,74658,null,46.25,{"v":11920.625,"d":"11920.63"},{"v":261.5276503434174,"d":"261.53"}]
["HP","outside range",10000,100,100,null,1000,null,10000,100,100,100,{"$nulls":4},51.8,48626,803.9955291407889]

{"sheet":"angles","index":6,"n_rows":88,"n_cols":13,"rows_kept":88}
[null,null,"Angle Dimensions "]
[null,null,"h","t","b","tf","A",null,"hw","tw","wf","tf"]
[]
["L","L  65*9.0*50*9.0",65,9,50,9,960,null,56,9,50,9,{"$f":"I4*SQRT(360)/J4","v":118.0583659796195}]
["L","L  75*9.0*50*9.0",75,9,50,9,1050,null,66,9,50,9,{"$f":"I5*SQRT(360)/J5","v":139.1402170474087}]
["L","L  75*9.0*55*9.0",75,9,55,9,1090,null,66,9,55,9,139.1402170474087]
["L","L 100 x 65 x 7",100,7,65,7,1120,null,93,7,65,7,252.0787049105651]
["L","L 100 x 65 x 8",100,8,65,8,1270,null,92,8,65,8,218.19715855161817]
["L","L 100 x 75 x 8",100,8,75,8,1350,null,92,8,75,8,218.19715855161817]
["L","L  80*10.0*65*10.0",80,10,65,10,1360,null,70,10,65,10,132.81566172707193]
["L","L  100*10.0*50*10.0",100,10,50,10,1410,null,90,10,50,10,170.7629936490925]
["L","L  100*9.0*65*9.0",100,9,65,9,1420,null,91,9,65,9,191.84484471688168]
["L","L  100*9.0*75*9.0",100,9,75,9,1510,null,91,9,75,9,191.84484471688168]
["L","L 120 x 80 x 8",120,8,80,8,1550,null,112,8,80,8,265.63132345414385]
["L","L 125 x 75 x 8",125,8,75,8,1550,null,117,8,75,8,277.4898646797753]
["L","L 100 x 75 x 10",100,10,75,10,{"v":1660.0000000000002,"d":"1660"},null,90,10,75,10,170.7629936490925]
["L","L  100*11.0*65*11.0",100,11,65,11,1710,null,89,11,65,11,153.51420641181042]
["L","L  100*11.0*75*11.0",100,11,75,11,1820,null,89,11,75,11,153.51420641181042]
["L","L  130*10.0*65*10.0",130,10,65,10,1860,null,120,10,65,10,227.68399153212331]
["L","L  120*10.0*80*10.0",120,10,80,10,1910,null,110,10,80,10,208.71032557111303]
["L","L 125 x 75 x 10",125,10,75,10,1920,null,115,10,75,10,218.19715855161817]
["L","L  150*9.0*75*9.0",150,9,75,9,1950,null,141,9,75,9,297.2541000558277]
["L","L  130*10.0*75*10.0",130,10,75,10,1960,null,120,10,75,10,227.68399153212331]
["L","L 100 x 75 x 12",100,12,75,12,1970,null,88,12,75,12,139.1402170474087]
["L","L  130*10.0*90*10.0",130,10,90,10,2120,null,120,10,90,10,227.68399153212331]
["L","L 150 x 75 x 10",150,10,75,10,2170,null,140,10,75,10,265.63132345414385]
["L","L  130*12.0*65*12.0",130,12,65,12,2210,null,118,12,65,12,186.57438194993438]
["L","L  120*12.0*80*12.0",120,12,80,12,2270,null,108,12,80,12,170.76299364909246]
["L","L 125 x 75 x 12",125,12,75,12,2270,null,113,12,75,12,178.66868779951344]
["L","L  150*10.0*90*10.0",150,10,90,10,2290,null,140,10,90,10,265.63132345414385]
["L","L  160*10.0*80*10.0",160,10,80,10,2320,null,150,10,80,10,284.60498941515414]
["L","L  130*12.0*75*12.0",130,12,75,12,2330,null,118,12,75,12,186.57438194993438]
["L","L  150*11.0*75*11.0",150,11,75,11,2360,null,139,11,75,11,239.75814259822076]
["L","L  150*10.0*100*10.0",150,10,100,10,2420,null,140,10,100,10,265.63132345414385]
["L","L  130*12.0*90*12.0",130,12,90,12,2510,null,118,12,90,12,186.57438194993438]
["L","L 150 x 75 x 12",150,12,75,12,2570,null,138,12,75,12,218.19715855161817]
["L","L  120*14.0*80*14.0",120,14,80,14,2620,null,106,14,80,14,143.65775656193495]
["L","L  180*10.0*90*10.0",180,10,90,10,2620,null,170,10,90,10,322.5523213371747]
["L","L  150*12.0*90*12.0",150,12,90,12,2730,null,138,12,90,12,218.19715855161817]
["L","L  160*12.0*80*12.0",160,12,80,12,2750,null,148,12,80,12,234.00854685246009]
["L","L  200*9.0*90*12.0",200,9,90,12,2810,null,191,9,90,12,402.66335539477365]
["L","L  150*12.0*100*12.0",150,12,100,12,2870,null,138,12,100,12,218.19715855161817]
["L","L  200*10.0*100*10.0",200,10,100,10,2920,null,190,10,100,10,360.49965325919527]
["L","L  225*9.0*90*12.0",225,9,90,12,3030,null,216,9,90,12,455.3679830642466]
["L","L  180*12.0*90*12.0",180,12,90,12,3120,null,168,12,90,12,265.63132345414385]
["L","L 150 x 75 x 15",150,15,75,15,3170,null,135,15,75,15,170.7629936490925]
["L","L  160*14.0*80*14.0",160,14,80,14,3180,null,146,14,80,14,197.86823073625004]
["L","L  200*10.5*90*14.0",200,10.5,90,14,3250,null,189.5,10.5,90,14,342.4294952010902]
["L","L  150*14.0*100*14.0",150,14,100,14,3320,null,136,14,100,14,184.31561219267127]
["L","L  250*10.0*90*10.0",250,10,90,10,3320,null,240,10,90,10,455.36798306424663]
["L","L  250*9.0*90*13.0",250,9,90,13,3340,null,241,9,90,13,508.07261073371967]
["L","L 150 x 90 x 15",150,15,90,15,3400,null,135,15,90,15,170.7629936490925]
["L","L  200*12.0*100*12.0",200,12,100,12,3480,null,188,12,100,12,297.2541000558277]
["L","L  200*11.5*90*15.0",200,11.5,90,15,3510,null,188.5,11.5,90,15,311.0031333609076]
["L","L  225*10.5*90*14.0",225,10.5,90,14,3510,null,214.5,10.5,90,14,387.60489034635276]
["L","L  180*14.0*90*14.0",180,14,90,14,3610,null,166,14,90,14,224.97346782340756]
["L","L  225*11.5*90*15.0",225,11.5,90,15,3800,null,213.5,11.5,90,15,352.2502332761473]
["L","L  250*10.5*90*15.0",250,10.5,90,15,3850,null,239.5,10.5,90,15,432.78028549161536]
["L","L  250*12.0*90*12.0",250,12,90,12,3960,null,238,12,90,12,376.31104156003715]
["L","L  200*14.0*100*14.0",200,14,100,14,4030,null,186,14,100,14,252.0787049105651]
["L","L 200 x 150 x 12",200,12,150,12,4090,null,188,12,150,12,297.2541000558277]
["L","L  250*11.5*90*16.0",250,11.5,90,16,4170,null,238.5,11.5,90,16,393.497333191387]
["L","L  275*10.5*100*14.0",275,10.5,100,14,4180,null,264.5,10.5,100,14,477.9556806368779]
["L","L 200 x 100 x 15",200,15,100,15,4310,null,185,15,100,15,234.00854685246006]
["L","L  275*11.5*100*15.0",275,11.5,100,15,4530,null,263.5,11.5,100,15,434.7444331066268]
["L","L  300*10.5*100*15.0",300,10.5,100,15,4530,null,289.5,10.5,100,15,523.1310757821404]
["L","L  200*16.0*100*16.0",200,16,100,16,4570,null,184,16,100,16,218.19715855161817]
["L","L  250*14.0*90*14.0",250,14,90,14,4590,null,236,14,90,14,319.84179762845895]
["L","L  300*11.5*100*16.0",300,11.5,100,16,4900,null,288.5,11.5,100,16,{"$f":"I69*SQRT(360)/J69","v":475.9915330218665}]
["L","L  325*10.5*120*14.0",325,10.5,120,14,5010,null,314.5,10.5,120,14,568.3064709274031]
["L","L 200 x 150 x 15",200,15,150,15,5060,null,185,15,150,15,234.00854685246006]
["L","L  250*16.0*90*16.0",250,16,90,16,5210,null,234,16,90,16,277.4898646797753]
["L","L  325*11.5*120*15.0",325,11.5,120,15,5430,null,313.5,11.5,120,15,517.2386329371062]
["L","L  350*10.5*120*16.0",350,10.5,120,16,5490,null,339.5,10.5,120,16,613.4818660726656]
["L","L  375*10.5*120*18.0",375,10.5,120,18,5970,null,364.5,10.5,120,18,658.6572612179282]
["L","L 200 x 150 x 18",200,18,150,18,6010,null,182,18,150,18,191.84484471688168]
["L","L  350*11.5*120*18.0",350,11.5,120,18,6040,null,338.5,11.5,120,18,558.485732852346]
["L","L  375*11.5*120*20.0",375,11.5,120,20,6540,null,363.5,11.5,120,20,599.7328327675857]
["L","L  400*11.5*120*23.0",400,11.5,120,23,7160,null,388.5,11.5,120,23,640.9799326828254]
["L","L  425*11.5*120*24.0",425,11.5,120,24,7550,null,413.5,11.5,120,24,682.2270325980652]
["L","L  400*12.5*120*25.0",400,12.5,120,25,7750,null,387.5,12.5,120,25,588.1836447913186]
["L","L  450*11.5*120*25.0",450,11.5,120,25,7950,null,438.5,11.5,120,25,723.4741325133049]
["L","L  425*12.5*120*26.0",425,12.5,120,26,8170,null,412.5,12.5,120,26,626.1309767133391]
["L","L  475*11.5*120*28.0",475,11.5,120,28,8560,null,463.5,11.5,120,28,764.7212324285446]
["L","L  450*12.5*120*27.0",450,12.5,120,27,8590,null,437.5,12.5,120,27,664.0783086353597]
["L","L  475*12.5*120*30.0",475,12.5,120,30,9220,null,462.5,12.5,120,30,702.0256405573803]
["L","L  500*13.5*120*35.0",500,13.5,120,35,10540,null,486.5,13.5,120,35,683.7547029652962]
["L","outside range",10000,100,100,100,107500,null,10000,100,100,100]

{"sheet":"half_I","index":7,"n_rows":79,"n_cols":14,"rows_kept":79}
[]
[null,null,"h","tw","b","t f","A",null,"hw","tw","wf","tf","A"]
[null,null,"mm","mm","mm","mm","cm2",null,{"$f":"C3","v":"mm"},{"$f":"D3","v":"mm"},{"$f":"E3","v":"mm"},{"$f":"F3","v":"mm"},"mm2"]
["half_I","IPE 100 A_half",98,3.6,55,4.7,8.78,null,44.3,3.6,55,4.7,{"v":417.98,"d":"418"},{"$f":"I4*SQRT(360)/J4","v":{"v":233.48150057576532,"d":"233.5"}}]
["half_I","IPE 100_half",100,4.1,55,5.7,10.3,null,44.3,4.1,55,5.7,{"v":495.13,"d":"495"},{"$f":"I5*SQRT(360)/J5","v":{"v":205.00814684701348,"d":"205.0"}}]
["half_I","IPE 120 A_half",118,3.8,64,5.1,11,null,53.9,3.8,64,5.1,{"v":531.22,"d":"531"},{"v":269.12647244696154,"d":"269.1"}]
["half_I","IPE 120_half",120,4.4,64,6.3,13.2,null,53.7,4.4,64,6.3,{"v":639.48,"d":"639"},{"v":231.5649686605118,"d":"231.6"}]
["half_I","IPE 140 A_half",138,3.8,73,5.6,13.4,null,63.4,3.8,73,5.6,{"v":649.7199999999999,"d":"650"},{"v":316.56063734948725,"d":"316.6"}]
["half_I","IPE 160 A_half",157,4,82,5.9,16.2,null,72.6,4,82,5.9,{"v":774.2,"d":"774"},{"v":344.3720371923365,"d":"344.4"}]
["half_I","IPE 140_half",140,4.7,73,6.9,16.4,null,63.1,4.7,73,6.9,{"v":800.27,"d":"800"},{"v":254.73155790207414,"d":"254.7"}]
["half_I","IPE 140 R_half",142,5.3,72,7.8,18.4,null,63.2,5.3,72,7.8,{"v":896.56,"d":"897"},{"v":226.2520167426131,"d":"226.3"}]
["half_I","IPE 180 A_half",177,4.3,91,6.5,19.6,null,82,4.3,91,6.5,{"v":944.0999999999999,"d":"944"},{"v":361.8233973960099,"d":"361.8"}]
["half_I","IPE 160_half",160,5,82,7.4,20.1,null,72.6,5,82,7.4,{"v":969.8000000000001,"d":"970"},{"v":275.4976297538692,"d":"275.5"}]
["half_I","IPE 160 R_half",162,5.6,81,8.5,22.6,null,72.5,5.6,81,8.5,{"v":1094.5,"d":"1095"},{"v":245.64121110236522,"d":"245.6"}]
["half_I","IPE 200 A_half",197,4.5,100,7,23.5,null,91.5,4.5,100,7,{"v":1111.75,"d":"1112"},{"v":385.7978745405423,"d":"385.8"}]
["half_I","IPE 180_half",180,5.3,91,8,23.9,null,82,5.3,91,8,{"v":1162.6,"d":"1163"},{"v":293.554831849593,"d":"293.6"}]
["half_I","IPE 180 O_half",182,6,92,9,27.1,null,82,6,92,9,1320,{"v":259.3067681338071,"d":"259.3"}]
["half_I","IPE 220 A_half",217,5,110,7.7,28.3,null,100.8,5,110,7.7,1351,{"v":382.5091057739672,"d":"382.5"}]
["half_I","IPE 200_half",200,5.6,100,8.5,28.5,null,91.5,5.6,100,8.5,{"v":1362.4,"d":"1362"},{"v":310.01614918436434,"d":"310.0"}]
["half_I","IPE 180 R_half",183,6.4,89,9.5,28.1,null,82,6.4,89,9.5,{"v":1370.3000000000002,"d":"1370"},{"v":243.10009512544414,"d":"243.1"}]
["half_I","IPE 200 O_half",202,6.2,102,9.5,32,null,91.5,6.2,102,9.5,{"v":1536.3000000000002,"d":"1536"},{"v":280.014586360071,"d":"280.0"}]
["half_I","IPE 240 A_half",237,5.2,120,8.3,33.3,null,110.2,5.2,120,8.3,{"v":1569.0400000000002,"d":"1569"},{"v":402.0957670967947,"d":"402.1"}]
["half_I","IPE 220_half",220,5.9,110,9.2,33.4,null,100.8,5.9,110,9.2,{"v":1606.7199999999998,"d":"1607"},{"v":324.16025913048065,"d":"324.2"}]
["half_I","IPE 200 R_half",204,6.6,98,10.5,33.9,null,91.5,6.6,98,10.5,{"v":1632.9,"d":"1633"},{"v":263.04400536855155,"d":"263.0"}]
["half_I","IPE 220 O_half",222,6.6,112,10.2,37.4,null,100.8,6.6,112,10.2,{"v":1807.6799999999998,"d":"1808"},{"v":289.7796255863388,"d":"289.8"}]
["half_I","IPE 240_half",240,6.2,120,9.8,39.1,null,110.2,6.2,120,9.8,{"v":1859.24,"d":"1859"},{"v":337.24161111344074,"d":"337.2"}]
["half_I","IPE 270 A_half",267,5.5,135,8.7,39.1,null,124.8,5.5,135,8.7,{"v":1860.9,"d":"1861"},{"v":430.5297294425605,"d":"430.5"}]
["half_I","IPE 220 R_half",225,6.7,108,11.8,40.2,null,100.7,6.7,108,11.8,{"v":1949.0900000000001,"d":"1949"},{"v":285.1713675035425,"d":"285.2"}]
["half_I","IPE 240 O_half",242,7,122,10.8,43.7,null,110.2,7,122,10.8,2089,{"v":298.6997127004761,"d":"298.7"}]
["half_I","IPE 270_half",270,6.6,135,10.2,45.9,null,124.8,6.6,135,10.2,{"v":2200.68,"d":"2201"},{"v":358.7747745354671,"d":"358.8"}]
["half_I","IPE 300 A_half",297,6.1,150,9.2,46.5,null,139.3,6.1,150,9.2,{"v":2229.73,"d":"2230"},{"v":433.2838800604478,"d":"433.3"}]
["half_I","IPE 240 R_half",245,7.5,118,12.3,47.5,null,110.2,7.5,118,12.3,{"v":2277.9,"d":"2278"},{"v":278.7863985204443,"d":"278.8"}]
["half_I","IPE 300_half",300,7.1,150,10.7,53.8,null,139.3,7.1,150,10.7,{"v":2594.03,"d":"2594"},{"v":372.2579814603847,"d":"372.3"}]
["half_I","IPE 270 O_half",274,7.5,136,12.2,53.8,null,124.8,7.5,136,12.2,{"v":2595.2,"d":"2595"},{"v":315.72180159121103,"d":"315.7"}]
["half_I","IPE 330 A_half",327,6.5,160,10,54.7,null,153.5,6.5,160,10,{"v":2597.75,"d":"2598"},{"v":448.07041923308884,"d":"448.1"}]
["half_I","IPE 270 R_half",276,7.7,133,13.1,56,null,124.9,7.7,133,13.1,{"v":2704.0299999999997,"d":"2704"},{"v":307.7676465623615,"d":"307.8"}]
["half_I","IPE 330 _half",330,7.5,160,11.5,62.6,null,153.5,7.5,160,11.5,{"v":2991.25,"d":"2991"},{"v":388.327696668677,"d":"388.3"}]
["half_I","IPE 300 O_half",304,8,152,12.7,62.8,null,139.3,8,152,12.7,{"v":3044.8,"d":"3045"},{"v":330.37895854609144,"d":"330.4"}]
["half_I","IPE 360 A _half",357.6,6.6,170,11.5,64,null,167.3,6.6,170,11.5,{"v":3059.1800000000003,"d":"3059"},{"v":480.95368413288173,"d":"481.0"}]
["half_I","IPE 300 R_half",306,8.5,147,13.7,65.9,null,139.3,8.5,147,13.7,{"v":3197.95,"d":"3198"},{"v":310.94490216102724,"d":"310.9"}]
["half_I","IPE 400 A _half",397,7,180,12,73.1,null,186.5,7,180,12,{"v":3465.5,"d":"3466"},{"v":505.5126716754881,"d":"505.5"}]
["half_I","IPE 330 O_half",334,8.5,162,13.5,72.6,null,153.5,8.5,162,13.5,{"v":3491.75,"d":"3492"},{"v":342.64208529589143,"d":"342.6"}]
["half_I","IPE 360  _half",360,8,170,12.7,72.7,null,167.3,8,170,12.7,{"v":3497.4,"d":"3497"},{"v":396.78678940962743,"d":"396.8"}]
["half_I","IPE 330 R _half",336,9.2,158,14.5,76.8,null,153.5,9.2,158,14.5,{"v":3703.2,"d":"3703"},{"v":316.57149184946496,"d":"316.6"}]
["half_I","IPE 400  _half",400,8.6,180,13.5,84.5,null,186.5,8.6,180,13.5,{"v":4033.8999999999996,"d":"4034"},{"v":411.4638025265601,"d":"411.5"}]
["half_I","IPE 360 O _half",364,9.2,172,14.7,84.1,null,167.3,9.2,172,14.7,{"v":4067.5600000000004,"d":"4068"},{"v":345.0319907909804,"d":"345.0"}]
["half_I","IPE 450 A _half",447,7.6,190,13.1,85.5,null,210.4,7.6,190,13.1,{"v":4088.04,"d":"4088"},{"v":525.2709629206004,"d":"525.3"}]
["half_I","IPE 360 R _half",366,9.9,168,16,89.6,null,167,9.9,168,16,{"v":4341.3,"d":"4341"},{"v":320.060829847345,"d":"320.1"}]
["half_I","IPE 400 O _half",404,9.7,182,15.5,96.4,null,186.5,9.7,182,15.5,{"v":4630.05,"d":"4630"},{"v":364.80295894107394,"d":"364.8"}]
["half_I","IPE 450  _half",450,9.4,190,14.6,98.8,null,210.4,9.4,190,14.6,{"v":4751.76,"d":"4752"},{"v":424.6871615102726,"d":"424.7"}]
["half_I","IPE 500 A _half",497,8.4,200,14.5,101,null,234,8.4,200,14.5,{"v":4865.6,"d":"4866"},{"v":528.552123199572,"d":"528.6"}]
["half_I","IPE 400 R _half",407,10.6,178,17,104,null,186.5,10.6,178,17,{"v":5002.9,"d":"5003"},{"v":333.82912280456765,"d":"333.8"}]
["half_I","IPE 400 V _half",408,10.6,182,17.5,107,null,186.5,10.6,182,17.5,{"v":5161.9,"d":"5162"},{"v":333.82912280456765,"d":"333.8"}]
["half_I","IPE 500  _half",500,10.2,200,16,116,null,234,10.2,200,16,{"v":5586.799999999999,"d":"5587"},{"v":435.2782191055299,"d":"435.3"}]
["half_I","IPE 550 A _half",547,9,210,15.7,117,null,257.8,9,210,15.7,{"v":5617.200000000001,"d":"5617"},{"v":543.4901205276055,"d":"543.5"}]
["half_I","IPE 450 O _half",456,11,192,17.6,118,null,210.4,11,192,17.6,{"v":5693.6,"d":"5694"},{"v":362.91448347241476,"d":"362.9"}]
["half_I","IPE 450 R _half",458,11.3,188,18.6,121,null,210.4,11.3,188,18.6,{"v":5874.320000000001,"d":"5874"},{"v":353.2795856811117,"d":"353.3"}]
["half_I","IPE 450 V _half",460,12.4,194,19.6,132,null,210.4,12.4,194,19.6,{"v":6411.360000000001,"d":"6411"},{"v":321.94026759649694,"d":"321.9"}]
["half_I","IPE 550  _half",550,11.1,210,17.2,134,null,257.8,11.1,210,17.2,{"v":6473.58,"d":"6474"},{"v":440.66766529265317,"d":"440.7"}]
["half_I","IPE 600 A _half",597,9.8,220,17.5,137,null,281,9.8,220,17.5,{"v":6603.8,"d":"6604"},{"v":544.040830106519,"d":"544.0"}]
["half_I","IPE 500 O _half",506,12,202,19,137,null,234,12,202,19,6646,{"v":369.98648623970035,"d":"370.0"}]
["half_I","IPE 500 R _half",508,12.6,198,20,142,null,234,12.6,198,20,{"v":6908.4,"d":"6908"},{"v":352.368082133048,"d":"352.4"}]
["half_I","IPE 600  _half",600,12,220,19,156,null,281,12,220,19,7552,{"v":444.30001125365726,"d":"444.3"}]
["half_I","IPE 550 O _half",556,12.7,212,20.2,156,null,257.8,12.7,212,20.2,{"v":7556.459999999999,"d":"7556"},{"v":385.15047911405117,"d":"385.2"}]
["half_I","IPE 500 V _half",514,14.2,204,23,164,null,234,14.2,204,23,{"v":8014.799999999999,"d":"8015"},{"v":312.66463625890174,"d":"312.7"}]
["half_I","IPE 550 R _half",560,14,210,22.2,170,null,257.8,14,210,22.2,{"v":8271.2,"d":"8271"},{"v":349.3865060534607,"d":"349.4"}]
["half_I","IPE 750 x 137_half",753,11.5,263,17,175,null,359.5,11.5,263,17,{"v":8605.25,"d":"8605"},{"v":593.1332967811474,"d":"593.1"}]
["half_I","IPE 600 R _half",608,14,218,23,184,null,281,14,218,23,8948,{"v":380.8285810745634,"d":"380.8"}]
["half_I","IPE 750 x 147_half",753,13.2,265,17,187,null,359.5,13.2,265,17,{"v":9250.4,"d":"9250"},{"$f":"I69*SQRT(360)/J69","v":{"v":516.744917650242,"d":"516.7"}}]
["half_I","IPE 600 O _half",610,15,224,24,197,null,281,15,224,24,9591,{"v":355.4400090029258,"d":"355.4"}]
["half_I","IPE 550 V _half",566,17.1,216,25.2,202,null,257.8,17.1,216,25.2,{"v":9851.58,"d":"9852"},{"v":286.0474318566345,"d":"286.0"}]
["half_I","IPE 750 x 161_half",758,13.8,266,19.3,204,null,359.7,13.8,266,19.3,{"v":10097.66,"d":"10098"},{"v":494.5527279837243,"d":"494.6"}]
["half_I","IPE 750 x 173_half",762,14.4,267,21.6,221,null,359.4,14.4,267,21.6,{"v":10942.560000000001,"d":"10943"},{"v":473.5510796102148,"d":"473.6"}]
["half_I","IPE 600 V _half",618,18,228,28,234,null,281,18,228,28,11442,{"v":296.2000075024382,"d":"296.2"}]
["half_I","IPE 750 x 185_half",766,14.9,267,23.6,236,null,359.4,14.9,267,23.6,{"v":11656.26,"d":"11656"},{"v":457.6601037843687,"d":"457.7"}]
["half_I","IPE 750 x 196_half",770,15.6,268,25.4,251,null,359.6,15.6,268,25.4,{"v":12416.96,"d":"12417"},{"v":437.3673256140574,"d":"437.4"}]
["half_I","IPE 750 x 210_half",775,16,268,28,268,null,359.5,16,268,28,13256,{"v":426.31455706144965,"d":"426.3"}]
["half_I","IPE 750 x 222_half",778,17,269,29.5,283,null,359.5,17,269,29.5,14047,{"v":401.237230175482,"d":"401.2"}]
["half_I","outside range",{"$nulls":6},10000,100,100,100]

{"sheet":"WT (half_W)","index":8,"n_rows":79,"n_cols":26,"rows_kept":79}
[]
[null,null,"h","tw","b","t f","A",null,"hw","tw","wf","tf","A",null,"h","tw","b","t f","A",null,"hw","tw","wf","tf","A"]
[null,null,"in","in","in","in","in2",null,{"$f":"C3","v":"in"},{"$f":"D3","v":"in"},{"$f":"E3","v":"in"},{"$f":"F3","v":"in"},"mm2",null,"mm","mm","mm","mm","cm2",null,{"$f":"O3","v":"mm"},{"$f":"P3","v":"mm"},{"$f":"Q3","v":"mm"},{"$f":"R3","v":"mm"},"mm2"]
["WT","W 4x3#_half",{"$nulls":12},98,3.6,55,4.7,8.78,null,44.3,3.6,55,4.7,{"v":417.98,"d":"418"},{"$f":"U4*SQRT(360)/V4","v":{"v":233.48150057576532,"d":"233.5"}}]
["WT","W 5x16#",{"$nulls":12},100,4.1,55,5.7,10.3,null,44.3,4.1,55,5.7,{"v":495.13,"d":"495"},{"$f":"U5*SQRT(360)/V5","v":{"v":205.00814684701348,"d":"205.0"}}]
["WT","W 5x19#",{"$nulls":12},118,3.8,64,5.1,11,null,53.9,3.8,64,5.1,{"v":531.22,"d":"531"},{"v":269.12647244696154,"d":"269.1"}]
["WT","W 6x9#",{"$nulls":12},120,4.4,64,6.3,13.2,null,53.7,4.4,64,6.3,{"v":639.48,"d":"639"},{"v":231.5649686605118,"d":"231.6"}]
["WT","W 6x12#",{"$nulls":12},138,3.8,73,5.6,13.4,null,63.4,3.8,73,5.6,{"v":649.7199999999999,"d":"650"},{"v":316.56063734948725,"d":"316.6"}]
["WT","W 6x16#",{"$nulls":12},157,4,82,5.9,16.2,null,72.6,4,82,5.9,{"v":774.2,"d":"774"},{"v":344.3720371923365,"d":"344.4"}]
["WT","W 5x19#",{"$nulls":12},140,4.7,73,6.9,16.4,null,63.1,4.7,73,6.9,{"v":800.27,"d":"800"},{"v":254.73155790207414,"d":"254.7"}]
["WT","W 6x15#",{"$nulls":12},142,5.3,72,7.8,18.4,null,63.2,5.3,72,7.8,{"v":896.56,"d":"897"},{"v":226.2520167426131,"d":"226.3"}]
["WT","W 6x20#",{"$nulls":12},177,4.3,91,6.5,19.6,null,82,4.3,91,6.5,{"v":944.0999999999999,"d":"944"},{"v":361.8233973960099,"d":"361.8"}]
["WT","W 6x25#",{"$nulls":12},160,5,82,7.4,20.1,null,72.6,5,82,7.4,{"v":969.8000000000001,"d":"970"},{"v":275.4976297538692,"d":"275.5"}]
["WT","W 8x10#",{"$nulls":12},162,5.6,81,8.5,22.6,null,72.5,5.6,81,8.5,{"v":1094.5,"d":"1095"},{"v":245.64121110236522,"d":"245.6"}]
["WT","W 8x13#",{"$nulls":12},197,4.5,100,7,23.5,null,91.5,4.5,100,7,{"v":1111.75,"d":"1112"},{"v":385.7978745405423,"d":"385.8"}]
["WT","W 8x15#",{"$nulls":12},180,5.3,91,8,23.9,null,82,5.3,91,8,{"v":1162.6,"d":"1163"},{"v":293.554831849593,"d":"293.6"}]
["WT","W 8x18#",{"$nulls":12},182,6,92,9,27.1,null,82,6,92,9,1320,{"v":259.3067681338071,"d":"259.3"}]
["WT","W 8x21#",{"$nulls":12},217,5,110,7.7,28.3,null,100.8,5,110,7.7,1351,{"v":382.5091057739672,"d":"382.5"}]
["WT","W 8x24#",{"$nulls":12},200,5.6,100,8.5,28.5,null,91.5,5.6,100,8.5,{"v":1362.4,"d":"1362"},{"v":310.01614918436434,"d":"310.0"}]
["WT","W 8x28#",{"$nulls":12},183,6.4,89,9.5,28.1,null,82,6.4,89,9.5,{"v":1370.3000000000002,"d":"1370"},{"v":243.10009512544414,"d":"243.1"}]
["WT","W 8x31#",{"$nulls":12},202,6.2,102,9.5,32,null,91.5,6.2,102,9.5,{"v":1536.3000000000002,"d":"1536"},{"v":280.014586360071,"d":"280.0"}]
["WT","W 8x35#",{"$nulls":12},237,5.2,120,8.3,33.3,null,110.2,5.2,120,8.3,{"v":1569.0400000000002,"d":"1569"},{"v":402.0957670967947,"d":"402.1"}]
["WT","W 8x40#",{"$nulls":12},220,5.9,110,9.2,33.4,null,100.8,5.9,110,9.2,{"v":1606.7199999999998,"d":"1607"},{"v":324.16025913048065,"d":"324.2"}]
["WT","W 8x21#",{"$nulls":12},204,6.6,98,10.5,33.9,null,91.5,6.6,98,10.5,{"v":1632.9,"d":"1633"},{"v":263.04400536855155,"d":"263.0"}]
["WT","W 8x21#",{"$nulls":12},222,6.6,112,10.2,37.4,null,100.8,6.6,112,10.2,{"v":1807.6799999999998,"d":"1808"},{"v":289.7796255863388,"d":"289.8"}]
["WT","W 8x48#",{"$nulls":12},240,6.2,120,9.8,39.1,null,110.2,6.2,120,9.8,{"v":1859.24,"d":"1859"},{"v":337.24161111344074,"d":"337.2"}]
["WT","W 8x58#",{"$nulls":12},267,5.5,135,8.7,39.1,null,124.8,5.5,135,8.7,{"v":1860.9,"d":"1861"},{"v":430.5297294425605,"d":"430.5"}]
["WT","W 8x67#",{"$nulls":12},225,6.7,108,11.8,40.2,null,100.7,6.7,108,11.8,{"v":1949.0900000000001,"d":"1949"},{"v":285.1713675035425,"d":"285.2"}]
["WT","W 8x10#",{"$nulls":12},242,7,122,10.8,43.7,null,110.2,7,122,10.8,2089,{"v":298.6997127004761,"d":"298.7"}]
["WT","W 8x10#",{"$nulls":12},270,6.6,135,10.2,45.9,null,124.8,6.6,135,10.2,{"v":2200.68,"d":"2201"},{"v":358.7747745354671,"d":"358.8"}]
["WT","W 8x10#",{"$nulls":12},297,6.1,150,9.2,46.5,null,139.3,6.1,150,9.2,{"v":2229.73,"d":"2230"},{"v":433.2838800604478,"d":"433.3"}]
["WT","IPE 240 R_half",{"$nulls":12},245,7.5,118,12.3,47.5,null,110.2,7.5,118,12.3,{"v":2277.9,"d":"2278"},{"v":278.7863985204443,"d":"278.8"}]
["WT","IPE 300_half",{"$nulls":12},300,7.1,150,10.7,53.8,null,139.3,7.1,150,10.7,{"v":2594.03,"d":"2594"},{"v":372.2579814603847,"d":"372.3"}]
["WT","IPE 270 O_half",{"$nulls":12},274,7.5,136,12.2,53.8,null,124.8,7.5,136,12.2,{"v":2595.2,"d":"2595"},{"v":315.72180159121103,"d":"315.7"}]
["WT","IPE 330 A_half",{"$nulls":12},327,6.5,160,10,54.7,null,153.5,6.5,160,10,{"v":2597.75,"d":"2598"},{"v":448.07041923308884,"d":"448.1"}]
["WT","IPE 270 R_half",{"$nulls":12},276,7.7,133,13.1,56,null,124.9,7.7,133,13.1,{"v":2704.0299999999997,"d":"2704"},{"v":307.7676465623615,"d":"307.8"}]
["WT","IPE 330 _half",{"$nulls":12},330,7.5,160,11.5,62.6,null,153.5,7.5,160,11.5,{"v":2991.25,"d":"2991"},{"v":388.327696668677,"d":"388.3"}]
["WT","IPE 300 O_half",{"$nulls":12},304,8,152,12.7,62.8,null,139.3,8,152,12.7,{"v":3044.8,"d":"3045"},{"v":330.37895854609144,"d":"330.4"}]
["WT","IPE 360 A _half",{"$nulls":12},357.6,6.6,170,11.5,64,null,167.3,6.6,170,11.5,{"v":3059.1800000000003,"d":"3059"},{"v":480.95368413288173,"d":"481.0"}]
["WT","IPE 300 R_half",{"$nulls":12},306,8.5,147,13.7,65.9,null,139.3,8.5,147,13.7,{"v":3197.95,"d":"3198"},{"v":310.94490216102724,"d":"310.9"}]
["WT","IPE 400 A _half",{"$nulls":12},397,7,180,12,73.1,null,186.5,7,180,12,{"v":3465.5,"d":"3466"},{"v":505.5126716754881,"d":"505.5"}]
["WT","IPE 330 O_half",{"$nulls":12},334,8.5,162,13.5,72.6,null,153.5,8.5,162,13.5,{"v":3491.75,"d":"3492"},{"v":342.64208529589143,"d":"342.6"}]
["WT","IPE 360  _half",{"$nulls":12},360,8,170,12.7,72.7,null,167.3,8,170,12.7,{"v":3497.4,"d":"3497"},{"v":396.78678940962743,"d":"396.8"}]
["WT","IPE 330 R _half",{"$nulls":12},336,9.2,158,14.5,76.8,null,153.5,9.2,158,14.5,{"v":3703.2,"d":"3703"},{"v":316.57149184946496,"d":"316.6"}]
["WT","IPE 400  _half",{"$nulls":12},400,8.6,180,13.5,84.5,null,186.5,8.6,180,13.5,{"v":4033.8999999999996,"d":"4034"},{"v":411.4638025265601,"d":"411.5"}]
["WT","IPE 360 O _half",{"$nulls":12},364,9.2,172,14.7,84.1,null,167.3,9.2,172,14.7,{"v":4067.5600000000004,"d":"4068"},{"v":345.0319907909804,"d":"345.0"}]
["WT","IPE 450 A _half",{"$nulls":12},447,7.6,190,13.1,85.5,null,210.4,7.6,190,13.1,{"v":4088.04,"d":"4088"},{"v":525.2709629206004,"d":"525.3"}]
["WT","IPE 360 R _half",{"$nulls":12},366,9.9,168,16,89.6,null,167,9.9,168,16,{"v":4341.3,"d":"4341"},{"v":320.060829847345,"d":"320.1"}]
["WT","IPE 400 O _half",{"$nulls":12},404,9.7,182,15.5,96.4,null,186.5,9.7,182,15.5,{"v":4630.05,"d":"4630"},{"v":364.80295894107394,"d":"364.8"}]
["WT","IPE 450  _half",{"$nulls":12},450,9.4,190,14.6,98.8,null,210.4,9.4,190,14.6,{"v":4751.76,"d":"4752"},{"v":424.6871615102726,"d":"424.7"}]
["WT","IPE 500 A _half",{"$nulls":12},497,8.4,200,14.5,101,null,234,8.4,200,14.5,{"v":4865.6,"d":"4866"},{"v":528.552123199572,"d":"528.6"}]
["WT","IPE 400 R _half",{"$nulls":12},407,10.6,178,17,104,null,186.5,10.6,178,17,{"v":5002.9,"d":"5003"},{"v":333.82912280456765,"d":"333.8"}]
["WT","IPE 400 V _half",{"$nulls":12},408,10.6,182,17.5,107,null,186.5,10.6,182,17.5,{"v":5161.9,"d":"5162"},{"v":333.82912280456765,"d":"333.8"}]
["WT","IPE 500  _half",{"$nulls":12},500,10.2,200,16,116,null,234,10.2,200,16,{"v":5586.799999999999,"d":"5587"},{"v":435.2782191055299,"d":"435.3"}]
["WT","IPE 550 A _half",{"$nulls":12},547,9,210,15.7,117,null,257.8,9,210,15.7,{"v":5617.200000000001,"d":"5617"},{"v":543.4901205276055,"d":"543.5"}]
["WT","IPE 450 O _half",{"$nulls":12},456,11,192,17.6,118,null,210.4,11,192,17.6,{"v":5693.6,"d":"5694"},{"v":362.91448347241476,"d":"362.9"}]
["WT","IPE 450 R _half",{"$nulls":12},458,11.3,188,18.6,121,null,210.4,11.3,188,18.6,{"v":5874.320000000001,"d":"5874"},{"v":353.2795856811117,"d":"353.3"}]
["WT","IPE 450 V _half",{"$nulls":12},460,12.4,194,19.6,132,null,210.4,12.4,194,19.6,{"v":6411.360000000001,"d":"6411"},{"v":321.94026759649694,"d":"321.9"}]
["WT","IPE 550  _half",{"$nulls":12},550,11.1,210,17.2,134,null,257.8,11.1,210,17.2,{"v":6473.58,"d":"6474"},{"v":440.66766529265317,"d":"440.7"}]
["WT","IPE 600 A _half",{"$nulls":12},597,9.8,220,17.5,137,null,281,9.8,220,17.5,{"v":6603.8,"d":"6604"},{"v":544.040830106519,"d":"544.0"}]
["WT","IPE 500 O _half",{"$nulls":12},506,12,202,19,137,null,234,12,202,19,6646,{"v":369.98648623970035,"d":"370.0"}]
["WT","IPE 500 R _half",{"$nulls":12},508,12.6,198,20,142,null,234,12.6,198,20,{"v":6908.4,"d":"6908"},{"v":352.368082133048,"d":"352.4"}]
["WT","IPE 600  _half",{"$nulls":12},600,12,220,19,156,null,281,12,220,19,7552,{"v":444.30001125365726,"d":"444.3"}]
["WT","IPE 550 O _half",{"$nulls":12},556,12.7,212,20.2,156,null,257.8,12.7,212,20.2,{"v":7556.459999999999,"d":"7556"},{"v":385.15047911405117,"d":"385.2"}]
["WT","IPE 500 V _half",{"$nulls":12},514,14.2,204,23,164,null,234,14.2,204,23,{"v":8014.799999999999,"d":"8015"},{"v":312.66463625890174,"d":"312.7"}]
["WT","IPE 550 R _half",{"$nulls":12},560,14,210,22.2,170,null,257.8,14,210,22.2,{"v":8271.2,"d":"8271"},{"v":349.3865060534607,"d":"349.4"}]
["WT","IPE 750 x 137_half",{"$nulls":12},753,11.5,263,17,175,null,359.5,11.5,263,17,{"v":8605.25,"d":"8605"},{"v":593.1332967811474,"d":"593.1"}]
["WT","IPE 600 R _half",{"$nulls":12},608,14,218,23,184,null,281,14,218,23,8948,{"v":380.8285810745634,"d":"380.8"}]
["WT","IPE 750 x 147_half",{"$nulls":12},753,13.2,265,17,187,null,359.5,13.2,265,17,{"v":9250.4,"d":"9250"},{"$f":"U69*SQRT(360)/V69","v":{"v":516.744917650242,"d":"516.7"}}]
["WT","IPE 600 O _half",{"$nulls":12},610,15,224,24,197,null,281,15,224,24,9591,{"v":355.4400090029258,"d":"355.4"}]
["WT","IPE 550 V _half",{"$nulls":12},566,17.1,216,25.2,202,null,257.8,17.1,216,25.2,{"v":9851.58,"d":"9852"},{"v":286.0474318566345,"d":"286.0"}]
["WT","IPE 750 x 161_half",{"$nulls":12},758,13.8,266,19.3,204,null,359.7,13.8,266,19.3,{"v":10097.66,"d":"10098"},{"v":494.5527279837243,"d":"494.6"}]
["WT","IPE 750 x 173_half",{"$nulls":12},762,14.4,267,21.6,221,null,359.4,14.4,267,21.6,{"v":10942.560000000001,"d":"10943"},{"v":473.5510796102148,"d":"473.6"}]
["WT","IPE 600 V _half",{"$nulls":12},618,18,228,28,234,null,281,18,228,28,11442,{"v":296.2000075024382,"d":"296.2"}]
["WT","IPE 750 x 185_half",{"$nulls":12},766,14.9,267,23.6,236,null,359.4,14.9,267,23.6,{"v":11656.26,"d":"11656"},{"v":457.6601037843687,"d":"457.7"}]
["WT","IPE 750 x 196_half",{"$nulls":12},770,15.6,268,25.4,251,null,359.6,15.6,268,25.4,{"v":12416.96,"d":"12417"},{"v":437.3673256140574,"d":"437.4"}]
["WT","IPE 750 x 210_half",{"$nulls":12},775,16,268,28,268,null,359.5,16,268,28,13256,{"v":426.31455706144965,"d":"426.3"}]
["WT","IPE 750 x 222_half",{"$nulls":12},778,17,269,29.5,283,null,359.5,17,269,29.5,14047,{"v":401.237230175482,"d":"401.2"}]
["WT","outside range",{"$nulls":18},10000,100,100,100]

{"sheet":"cropped_I","index":9,"n_rows":59,"n_cols":14,"rows_kept":59}
[]
[null,null,"h","tw","b","t f","r","A","hw","tw","wf","tf","A"]
[null,null,"mm","mm","mm","mm","mm","cm2","mm","mm","mm","mm","mm2"]
["cropped_I","IPE 100 A_cropped",98,3.6,55,4.7,7,8.78,81.6,3.6,55,4.7,{"v":552.26,"d":"552"},{"$f":"I4*SQRT(360)/J4","v":{"v":430.06976178289955,"d":"430.1"}}]
["cropped_I","IPE 100_cropped",100,4.1,55,5.7,7,10.3,81.6,4.1,55,5.7,{"v":648.06,"d":"648"},{"v":377.6222298581557,"d":"377.6"}]
["cropped_I","IPE 120 A_cropped",118,3.8,64,5.1,7,11,100.80000000000001,3.8,64,5.1,{"v":709.44,"d":"709"},{"v":503.30145496574636,"d":"503.3"}]
["cropped_I","IPE 120_cropped",120,4.4,64,6.3,7,13.2,100.4,4.4,64,6.3,{"v":844.96,"d":"845"},{"v":432.9445596557799,"d":"432.9"}]
["cropped_I","IPE 140 A_cropped",138,3.8,73,5.6,7,13.4,119.80000000000001,3.8,73,5.6,{"v":864.04,"d":"864"},{"v":598.1697847707977,"d":"598.2"}]
["cropped_I","IPE 160 A_cropped",157,4,82,5.9,7,16.2,138.2,4,82,5.9,{"v":1036.6,"d":"1037"},{"v":655.540158952905,"d":"655.5"}]
["cropped_I","IPE 140_cropped",140,4.7,73,6.9,7,16.4,119.19999999999999,4.7,73,6.9,{"v":1063.94,"d":"1064"},{"v":481.2044643728563,"d":"481.2"}]
["cropped_I","IPE 140 R_cropped",142,5.3,72,7.8,9,18.4,117.39999999999999,5.3,72,7.8,{"v":1183.82,"d":"1184"},{"v":420.28460072124653,"d":"420.3"}]
["cropped_I","IPE 180 A_cropped",177,4.3,91,6.5,9,19.6,155,4.3,91,6.5,1258,{"v":683.9344706875798,"d":"683.9"}]
["cropped_I","IPE 160_cropped",160,5,82,7.4,9,20.1,136.2,5,82,7.4,{"v":1287.8000000000002,"d":"1288"},{"v":516.84266077792,"d":"516.8"}]
["cropped_I","IPE 160 R_cropped",162,5.6,81,8.5,9,22.6,136,5.6,81,8.5,{"v":1450.1,"d":"1450"},{"v":460.7890304816782,"d":"460.8"}]
["cropped_I","IPE 200 A_cropped",197,4.5,100,7,9,23.5,174,4.5,100,7,1483,{"v":733.648417159064,"d":"733.6"}]
["cropped_I","IPE 180_cropped",180,5.3,91,8,9,23.9,155,5.3,91,8,{"v":1549.5,"d":"1550"},{"v":554.8902309352062,"d":"554.9"}]
["cropped_I","IPE 180 O_cropped",182,6,92,9,9,27.1,155,6,92,9,1758,{"v":490.15303732609885,"d":"490.2"}]
["cropped_I","IPE 220 A_cropped",217,5,110,7.7,12,28.3,189.60000000000002,5,110,7.7,1795,{"v":719.4814132415097,"d":"719.5"}]
["cropped_I","IPE 200_cropped",200,5.6,100,8.5,12,28.5,171,5.6,100,8.5,{"v":1807.6,"d":"1808"},{"v":579.3744427379924,"d":"579.4"}]
["cropped_I","IPE 180 R_cropped",183,6.4,89,9.5,12,28.1,152,6.4,89,9.5,{"v":1818.3000000000002,"d":"1818"},{"v":450.62456657399406,"d":"450.6"}]
["cropped_I","IPE 200 O_cropped",202,6.2,102,9.5,12,32,171,6.2,102,9.5,{"v":2029.2,"d":"2029"},{"v":523.305948279477,"d":"523.3"}]
["cropped_I","IPE 240 A_cropped",237,5.2,120,8.3,12,33.3,208.39999999999998,5.2,120,8.3,{"v":2079.68,"d":"2080"},{"v":760.4061512066426,"d":"760.4"}]
["cropped_I","IPE 220_cropped",220,5.9,110,9.2,12,33.4,189.60000000000002,5.9,110,9.2,{"v":2130.64,"d":"2131"},{"v":609.7300112216184,"d":"609.7"}]
["cropped_I","IPE 200 R_cropped",204,6.6,98,10.5,12,33.9,171,6.6,98,10.5,{"v":2157.6,"d":"2158"},{"v":491.59043626253896,"d":"491.6"}]
["cropped_I","IPE 220 O_cropped",222,6.6,112,10.2,12,37.4,189.60000000000002,6.6,112,10.2,{"v":2393.76,"d":"2394"},{"v":545.0616766981135,"d":"545.1"}]
["cropped_I","IPE 240_cropped",240,6.2,120,9.8,15,39.1,205.39999999999998,6.2,120,9.8,{"v":2449.4799999999996,"d":"2449"},{"v":628.5791916760501,"d":"628.6"}]
["cropped_I","IPE 220 R_cropped",225,6.7,108,11.8,15,40.2,186.39999999999998,6.7,108,11.8,{"v":2523.2799999999997,"d":"2523"},{"v":527.8643783779575,"d":"527.9"}]
["cropped_I","IPE 240 O_cropped",242,7,122,10.8,15,43.7,205.39999999999998,7,122,10.8,{"v":2755.3999999999996,"d":"2755"},{"v":556.7415697702157,"d":"556.7"}]
["cropped_I","IPE 270_cropped",270,6.6,135,10.2,15,45.9,234.60000000000002,6.6,135,10.2,{"v":2925.36,"d":"2925"},{"v":674.427580977729,"d":"674.4"}]
["cropped_I","IPE 240 R_cropped",245,7.5,118,12.3,15,47.5,205.39999999999998,7.5,118,12.3,{"v":2991.8999999999996,"d":"2992"},{"v":519.6254651188681,"d":"519.6"}]
["cropped_I","IPE 270 O_cropped",274,7.5,136,12.2,15,53.8,234.60000000000002,7.5,136,12.2,{"v":3418.7,"d":"3419"},{"v":593.4962712604015,"d":"593.5"}]
["cropped_I","IPE 300_cropped",300,7.1,150,10.7,15,53.8,263.6,7.1,150,10.7,{"v":3476.5600000000004,"d":"3477"},{"v":704.4307531439872,"d":"704.4"}]
["cropped_I","IPE 270 R_cropped",276,7.7,133,13.1,15,56,234.79999999999998,7.7,133,13.1,{"v":3550.2599999999998,"d":"3550"},{"v":578.57360618769,"d":"578.6"}]
["cropped_I","IPE 300 O_cropped",304,8,152,12.7,18,62.8,260.6,8,152,12.7,{"v":4015.2,"d":"4015"},{"v":618.0671686799099,"d":"618.1"}]
["cropped_I","IPE 330 _cropped",330,7.5,160,11.5,15,62.6,292,7.5,160,11.5,4030,{"v":738.7080614153334,"d":"738.7"}]
["cropped_I","IPE 300 R_cropped",306,8.5,147,13.7,18,65.9,260.6,8.5,147,13.7,4229,{"$f":"I36*SQRT(360)/J36","v":{"v":581.710276404621,"d":"581.7"}}]
["cropped_I","IPE 330 O_cropped",334,8.5,162,13.5,18,72.6,289,8.5,162,13.5,{"v":4643.5,"d":"4644"},{"v":645.1046426743494,"d":"645.1"}]
["cropped_I","IPE 360  _cropped",360,8,170,12.7,18,72.7,316.6,8,170,12.7,{"v":4691.8,"d":"4692"},{"v":750.8828304069817,"d":"750.9"}]
["cropped_I","IPE 330 R _cropped",336,9.2,158,14.5,18,76.8,289,9.2,158,14.5,{"v":4949.799999999999,"d":"4950"},{"v":596.0205937752141,"d":"596.0"}]
["cropped_I","IPE 360 O _cropped",364,9.2,172,14.7,21,84.1,313.6,9.2,172,14.7,{"v":5413.52,"d":"5414"},{"v":646.7545266709591,"d":"646.8"}]
["cropped_I","IPE 400  _cropped",400,8.6,180,13.5,18,84.5,355,8.6,180,13.5,5483,{"v":783.2152809486801,"d":"783.2"}]
["cropped_I","IPE 360 R _cropped",366,9.9,168,16,21,89.6,313,9.9,168,16,{"v":5786.700000000001,"d":"5787"},{"v":599.8744894743653,"d":"599.9"}]
["cropped_I","IPE 400 O _cropped",404,9.7,182,15.5,21,96.4,352,9.7,182,15.5,{"v":6235.4,"d":"6235"},{"v":688.5289091005791,"d":"688.5"}]
["cropped_I","IPE 400 R _cropped",407,10.6,178,17,21,104,352,10.6,178,17,{"v":6757.2,"d":"6757"},{"v":630.0689073844921,"d":"630.1"}]
["cropped_I","IPE 400 V _cropped",408,10.6,182,17.5,21,107,352,10.6,182,17.5,{"v":6916.2,"d":"6916"},{"v":630.0689073844921,"d":"630.1"}]
["cropped_I","IPE 450 O _cropped",456,11,192,17.6,21,118,399.79999999999995,11,192,17.6,7777,{"v":689.6065137465371,"d":"689.6"}]
["cropped_I","IPE 450 R _cropped",458,11.3,188,18.6,21,121,399.79999999999995,11.3,188,18.6,{"v":8014.54,"d":"8015"},{"v":671.2983762134431,"d":"671.3"}]
["cropped_I","IPE 450 V _cropped",460,12.4,194,19.6,21,132,399.79999999999995,12.4,194,19.6,{"v":8759.92,"d":"8760"},{"v":611.7477138074119,"d":"611.7"}]
["cropped_I","IPE 500 O _cropped",506,12,202,19,24,137,444,12,202,19,9166,{"v":702.0256405573801,"d":"702.0"}]
["cropped_I","IPE 500 R _cropped",508,12.6,198,20,24,142,444,12.6,198,20,{"v":9554.4,"d":"9554"},{"v":668.5958481498859,"d":"668.6"}]
["cropped_I","IPE 550 O _cropped",556,12.7,212,20.2,24,156,491.5999999999999,12.7,212,20.2,{"v":10525.719999999998,"d":"10526"},{"v":734.4452115301299,"d":"734.4"}]
["cropped_I","IPE 500 V _cropped",514,14.2,204,23,24,164,444,14.2,204,23,{"v":10996.8,"d":"10997"},{"v":593.2611046963776,"d":"593.3"}]
["cropped_I","IPE 550 R _cropped",560,14,210,22.2,24,170,491.5999999999999,14,210,22.2,{"v":11544.399999999998,"d":"11544"},{"v":666.246727602332,"d":"666.2"}]
["cropped_I","IPE 600 R _cropped",608,14,218,23,24,184,538,14,218,23,12546,{"v":729.1308776445377,"d":"729.1"}]
["cropped_I","IPE 600 O _cropped",610,15,224,24,24,197,538,15,224,24,13446,{"v":680.5221524682352,"d":"680.5"}]
["cropped_I","IPE 550 V _cropped",566,17.1,216,25.2,17,202,498.5999999999999,17.1,216,25.2,{"v":13969.259999999998,"d":"13969"},{"v":553.2321548631415,"d":"553.2"}]
["cropped_I","IPE 600 V _cropped",618,18,228,28,17,234,545,18,228,28,16194,{"v":574.4804415972555,"d":"574.5"}]
["cropped_I","IPE 750 x 222_cropped",778,17,269,29.5,17,283,702,17,269,29.5,{"v":19869.5,"d":"19870"},{"v":783.5007943899537,"d":"783.5"}]
[null,"outside range",{"$nulls":6},10000,100,100,100]

{"sheet":"flatbars","index":10,"n_rows":105,"n_cols":13,"rows_kept":105}
[]
[null,null,"h","tw",null,"A",null,null,"hw","tw"]
[{"$nulls":8},"mm","mm"]
["flat",{"$f":"CONCATENATE(\"F \",C4,\" x \",D4)","v":"F 60 x 6"},60,6,{"v":227.68399153212331,"d":"228"},{"$f":"C4*D4","v":360},null,{"$f":"C4*SQRT(360)/(D4-1)","v":227.68399153212331},{"$f":"C4","v":60},{"$f":"D4","v":6},0,0,360]
["flat",{"$f":"CONCATENATE(\"F \",C5,\" x \",D5)","v":"F 60 x 7"},60,7,{"v":189.73665961010278,"d":"190"},420,null,189.73665961010275,60,7,0,0,420]
["flat","F 60 x 8",60,8,{"v":162.63142252294523,"d":"163"},480,null,162.63142252294523,60,8,0,0,480]
["flat","F 80 x 7",80,7,{"v":243.947133784418,"d":"244"},560,null,252.98221281347037,80,7,0,0,560]
["flat","F 80 x 8",80,8,{"v":216.8418966972603,"d":"217"},640,null,216.84189669726032,80,8,0,0,640]
["flat","F 80 x 9",80,9,{"v":189.73665961010278,"d":"190"},720,null,189.73665961010278,80,9,0,0,720]
["flat","F 100 x 8",100,8,{"v":271.05237087157536,"d":"271"},800,null,271.05237087157536,100,8,0,0,800]
["flat","F 80 x 10",80,10,{"v":168.65480854231356,"d":"169"},800,null,168.6548085423136,80,10,0,0,800]
["flat","F 100 x 9",100,9,{"v":237.17082451262846,"d":"237"},900,null,237.17082451262846,100,9,0,0,900]
["flat","F 100 x 10",100,10,{"v":210.81851067789196,"d":"211"},1000,null,210.81851067789196,100,10,0,0,1000]
["flat","F 120 x 10",120,10,{"v":252.98221281347037,"d":"253"},1200,null,252.98221281347034,120,10,0,0,1200]
["flat","F 120 x 11",120,11,{"v":227.68399153212331,"d":"228"},1320,null,227.68399153212331,120,11,0,0,1320]
["flat","F 120 x 12",120,12,{"v":206.98544684738482,"d":"207"},1440,null,206.98544684738482,120,12,0,0,1440]
["flat","F 140 x 11",140,11,{"v":265.63132345414385,"d":"266"},1540,null,265.63132345414385,140,11,0,0,1540]
["flat","F 140 x 12",140,12,{"v":241.48302132194897,"d":"241"},1680,null,241.48302132194897,140,12,0,0,1680]
["flat","F 140 x 13",140,13,{"v":221.35943621178654,"d":"221"},1820,null,221.35943621178657,140,13,0,0,1820]
["flat","F 160 x 12",160,12,{"v":275.9805957965131,"d":"276"},1920,null,275.9805957965131,160,12,0,0,1920]
["flat","F 140 x 14",140,14,{"v":204.33178727241838,"d":"204"},1960,null,204.33178727241835,140,14,0,0,1960]
["flat","F 160 x 13",160,13,{"v":252.98221281347037,"d":"253"},2080,null,252.98221281347037,160,13,0,0,2080]
["flat","F 160 x 14",160,14,{"v":233.52204259704956,"d":"234"},2240,null,233.52204259704956,160,14,0,0,2240]
["flat","F 180 x 14",180,14,{"v":262.7122979216808,"d":"263"},2520,null,262.7122979216807,180,14,0,0,2520]
["flat","F 180 x 15",180,15,{"v":243.94713378441784,"d":"244"},2700,null,243.94713378441784,180,15,0,0,2700]
["flat","F 180 x 16",180,16,{"v":227.68399153212331,"d":"228"},2880,null,227.68399153212331,180,16,0,0,2880]
["flat","F 200 x 15",200,15,{"v":271.05237087157536,"d":"271"},3000,null,271.05237087157536,200,15,0,0,3000]
["flat","F 200 x 16",200,16,{"v":252.98221281347037,"d":"253"},3200,null,252.98221281347034,200,16,0,0,3200]
["flat","F 200 x 17",200,17,{"v":237.17082451262846,"d":"237"},3400,null,237.17082451262846,200,17,0,0,3400]
["flat","F 220 x 16",220,16,{"v":278.2804340948174,"d":"278"},3520,null,278.2804340948174,220,16,0,0,3520]
["flat","F 200 x 18",200,18,{"v":223.21959954129738,"d":"223"},3600,null,223.21959954129738,200,18,0,0,3600]
["flat","F 220 x 17",220,17,{"v":260.8879069638913,"d":"261"},3740,null,260.8879069638913,220,17,0,0,3740]
["flat","F 200 x 19",200,19,{"v":210.81851067789196,"d":"211"},3800,null,210.81851067789196,200,19,0,0,3800]
["flat","F 220 x 18",220,18,{"v":245.5415594954271,"d":"246"},3960,null,245.5415594954271,220,18,0,0,3960]
["flat","F 220 x 19",220,19,{"v":231.90036174568115,"d":"232"},4180,null,231.90036174568115,220,19,0,0,4180]
["flat","F 240 x 18",240,18,{"v":267.86351944955686,"d":"268"},{"$f":"C36*D36","v":4320},null,{"$f":"C36*SQRT(360)/(D36-1)","v":267.86351944955686},{"$f":"C36","v":240},{"$f":"D36","v":18},0,0,4320]
["flat","F 240 x 19",240,19,{"v":252.98221281347037,"d":"253"},4560,null,252.98221281347034,240,19,0,0,4560]
["flat","F 260 x 19",260,19,{"v":274.06406388125953,"d":"274"},4940,null,274.06406388125953,260,19,0,0,4940]
["flat","F 260 x 20",260,20,{"v":259.6396394664564,"d":"260"},5200,null,259.6396394664564,260,20,0,0,5200]
["flat","F 260 x 21",260,21,{"v":246.6576574931336,"d":"247"},5460,null,246.6576574931336,260,21,0,0,5460]
["flat","F 280 x 20",280,20,{"v":279.6119194254146,"d":"280"},5600,null,279.6119194254146,280,20,0,0,5600]
["flat","F 260 x 22",260,22,{"v":234.91205475536535,"d":"235"},5720,null,234.91205475536532,260,22,0,0,5720]
["flat","F 280 x 21",280,21,{"v":265.63132345414385,"d":"266"},5880,null,265.63132345414385,280,21,0,0,5880]
["flat","F 280 x 22",280,22,{"v":252.98221281347037,"d":"253"},6160,null,252.98221281347037,280,22,0,0,6160]
["flat","F 280 x 23",280,23,{"v":241.48302132194897,"d":"241"},6440,null,241.48302132194897,280,23,0,0,6440]
["flat","F 300 x 22",300,22,{"v":271.05237087157536,"d":"271"},6600,null,271.05237087157536,300,22,0,0,6600]
["flat","F 300 x 23",300,23,{"v":258.73180855923107,"d":"259"},6900,null,258.73180855923107,300,23,0,0,6900]
["flat","F 300 x 24",300,24,{"v":247.48259949143838,"d":"247"},7200,null,247.4825994914384,300,24,0,0,7200]
["flat","F 320 x 23",320,23,{"v":275.9805957965131,"d":"276"},7360,null,275.9805957965131,320,23,0,0,7360]
["flat","F 300 x 25",300,25,{"v":237.17082451262846,"d":"237"},7500,null,237.17082451262846,300,25,0,0,7500]
["flat","F 320 x 24",320,24,{"v":263.9814394575343,"d":"264"},7680,null,263.9814394575343,320,24,0,0,7680]
["flat","F 320 x 25",320,25,{"v":252.98221281347037,"d":"253"},8000,null,252.98221281347037,320,25,0,0,8000]
["flat","F 340 x 24",340,24,{"v":268.79360111431225,"d":"269"},8160,null,280.4802794236302,340,24,0,0,8160]
["flat","F 320 x 26",320,26,{"v":242.86292430093155,"d":"243"},8320,null,242.86292430093155,320,26,0,0,8320]
["flat","F 340 x 25",340,25,{"v":258.04185706973976,"d":"258"},8500,null,268.79360111431225,340,25,0,0,8500]
["flat","F 320 x 27",320,27,{"v":233.52204259704956,"d":"234"},8640,null,233.52204259704956,320,27,0,0,8640]
["flat","F 340 x 26",340,26,{"v":248.11717025936514,"d":"248"},8840,null,258.04185706973976,340,26,0,0,8840]
["flat","F 340 x 27",340,27,{"v":238.92764543494422,"d":"239"},9180,null,248.11717025936514,340,27,0,0,9180]
["flat","F 360 x 26",360,26,{"v":284.60498941515414,"d":"285"},9360,null,273.22078983854794,360,26,0,0,9360]
["flat","F 360 x 27",360,27,{"v":273.220789838548,"d":"273"},9720,null,262.7122979216807,360,27,0,0,9720]
["flat","F 360 x 28",360,28,{"v":262.7122979216808,"d":"263"},10080,null,252.98221281347034,360,28,0,0,10080]
["flat","F 380 x 27",380,27,{"v":277.30742558399635,"d":"277"},10260,null,277.30742558399635,380,27,0,0,10260]
["flat","F 360 x 29",360,29,{"v":252.98221281347037,"d":"253"},10440,null,243.94713378441784,360,29,0,0,10440]
["flat","F 380 x 28",380,28,{"v":267.0367801919965,"d":"267"},10640,null,267.03678019199646,380,28,0,0,10640]
["flat","F 360 x 30",360,30,{"v":243.94713378441784,"d":"244"},10800,null,235.53516365392068,360,30,0,0,10800]
["flat","F 380 x 29",380,29,{"v":257.4997523279966,"d":"257"},11020,null,257.4997523279966,380,29,0,0,11020]
["flat","F 360 x 31",360,31,{"v":235.53516365392068,"d":"236"},11160,null,227.68399153212331,360,31,0,0,11160]
["flat","F 400 x 28",400,28,{"v":281.0913475705226,"d":"281"},{"$f":"C68*D68","v":11200},null,{"$f":"C68*SQRT(360)/(D68-1)","v":281.0913475705226},{"$f":"C68","v":400},{"$f":"D68","v":28},0,0,11200]
["flat",{"$f":"CONCATENATE(\"F \",C69,\" x \",D69)","v":"F 380 x 30"},380,30,{"v":248.62045052358295,"d":"249"},11400,null,248.62045052358292,380,30,0,0,11400]
["flat","F 400 x 29",400,29,{"v":271.05237087157536,"d":"271"},11600,null,271.05237087157536,400,29,0,0,11600]
["flat","F 380 x 31",380,31,{"v":240.33310217279683,"d":"240"},11780,null,240.33310217279683,380,31,0,0,11780]
["flat","F 400 x 30",400,30,{"v":261.70573739324516,"d":"262"},12000,null,261.7057373932452,400,30,0,0,12000]
["flat","F 400 x 31",400,31,{"v":252.98221281347037,"d":"253"},12400,null,252.98221281347034,400,31,0,0,12400]
["flat","F 420 x 30",420,30,{"v":284.60498941515414,"d":"285"},12600,null,274.79102426290746,420,30,0,0,12600]
["flat","F 400 x 32",400,32,{"v":244.82149627110033,"d":"245"},12800,null,244.82149627110033,400,32,0,0,12800]
["flat","F 420 x 31",420,31,{"v":274.79102426290746,"d":"275"},13020,null,265.63132345414385,420,31,0,0,13020]
["flat","F 400 x 33",400,33,{"v":237.17082451262846,"d":"237"},13200,null,237.17082451262846,400,33,0,0,13200]
["flat","F 420 x 32",420,32,{"v":265.63132345414385,"d":"266"},13440,null,257.06257108465536,420,32,0,0,13440]
["flat","F 440 x 31",440,31,{"v":241.48302132194897,"d":"241"},13640,null,278.2804340948174,440,31,0,0,13640]
["flat","F 420 x 33",420,33,{"v":257.06257108465536,"d":"257"},13860,null,249.02936573825988,420,33,0,0,13860]
["flat","F 420 x 34",420,34,{"v":249.02936573825988,"d":"249"},14280,null,241.48302132194897,420,34,0,0,14280]
["flat","F 440 x 33",440,33,{"v":234.38057951836225,"d":"234"},14520,null,260.8879069638913,440,33,0,0,14520]
["flat","F 460 x 32",460,32,{"v":221.35943621178654,"d":"221"},14720,null,281.54472071176536,460,32,0,0,14720]
["flat","F 440 x 35",440,35,{"v":227.68399153212331,"d":"228"},15400,null,245.5415594954271,440,35,0,0,15400]
["flat","F 460 x 34",460,34,{"v":215.03488089145,"d":"215"},15640,null,264.4814043049917,460,34,0,0,15640]
["flat","F 480 x 34",480,34,{"v":208.710325571113,"d":"209"},16320,null,275.9805957965131,480,34,0,0,16320]
["flat","F 460 x 36",460,36,{"v":208.710325571113,"d":"209"},16560,null,249.36818120184932,460,36,0,0,16560]
["flat","F 480 x 36",480,36,{"v":208.710325571113,"d":"209"},17280,null,260.21027603671234,480,36,0,0,17280]
["flat","F 500 x 35",500,35,{"v":208.710325571113,"d":"209"},17500,null,279.02449942662173,500,35,0,0,17500]
["flat","F 480 x 38",480,38,{"v":208.710325571113,"d":"209"},18240,null,246.1448557104036,480,38,0,0,18240]
["flat","F 500 x 37",500,37,{"v":208.710325571113,"d":"209"},18500,null,263.5231383473649,500,37,0,0,18500]
["flat","F 525 x 37",525,37,{"v":208.710325571113,"d":"209"},19425,null,276.69929526473317,525,37,0,0,19425]
["flat","F 500 x 39",500,39,{"v":208.710325571113,"d":"209"},19500,null,249.65349948697732,500,39,0,0,19500]
["flat","F 550 x 39",550,39,{"v":208.710325571113,"d":"209"},21450,null,274.61884943567503,550,39,0,0,21450]
["flat","F 575 x 40",575,40,{"v":208.710325571113,"d":"209"},23000,null,279.73994686104896,575,40,0,0,23000]
["flat","F 600 x 42",600,42,{"v":208.710325571113,"d":"209"},25200,null,277.6634043074675,600,42,0,0,25200]
["flat","F 625 x 44",625,44,{"v":208.710325571113,"d":"209"},27500,null,275.78002850305637,625,44,0,0,27500]
["flat","F 650 x 45",650,45,{"v":208.710325571113,"d":"209"},29250,null,280.29279260583365,650,45,0,0,29250]
["flat","F 675 x 47",675,47,{"v":208.710325571113,"d":"209"},31725,null,278.4179244278682,675,47,0,0,31725]
["flat","F 700 x 49",700,49,{"v":208.710325571113,"d":"209"},34300,null,276.69929526473317,700,49,0,0,34300]
["flat","F 725 x 50",725,50,{"v":209.710325571113,"d":"210"},{"$f":"C101*D101","v":36250},null,{"$f":"C101*SQRT(360)/(D101-1)","v":280.7328126884173},{"$f":"C101","v":725},50,0,0,34300]
["flat","F 750 x 52",750,52,{"v":210.710325571113,"d":"211"},{"$f":"C102*D102","v":39000},null,{"$f":"C102*SQRT(360)/(D102-1)","v":279.02449942662173},750,52,0,0,34300]
["flat","F 775 x 55",775,55,{"v":211.710325571113,"d":"212"},{"$f":"C103*D103","v":42625},null,{"$f":"C103*SQRT(360)/(D103-1)","v":272.3072429589438},775,55,0,0,34300]
["flat","F 800 x 57",800,57,{"v":212.710325571113,"d":"213"},{"$f":"C104*D104","v":45600},null,{"$f":"C104*SQRT(360)/(D104-1)","v":271.05237087157536},800,57,0,0,34300]
[null,"outside range",{"$nulls":6},10000,100,100,100]

{"sheet":"built_t","index":11,"n_rows":157,"n_cols":15,"rows_kept":157}
[]
[null,null,"h","tw","wf","tf","A",null,"hw","tw"]
[{"$nulls":8},"mm","mm",{"$nulls":4},"mm3"]
["built_t",{"$f":"CONCATENATE(\"T \",C4,\" x \",D4, \", \",E4,\" x \",F4)","v":"T 80 x 5, 50 x 5"},80,5,{"$f":"C4/2+10","v":50},{"$f":"D4","v":5},{"$f":"C4*D4+E4*F4","v":650},{"$f":"C4*SQRT(360)/(D4-1)","v":{"v":379.47331922020555,"d":"379.5"}},{"$f":"C4","v":80},{"$f":"D4","v":5},{"$f":"E4","v":50},{"$f":"F4","v":5},{"$f":"I4*J4+K4*L4","v":650},null,{"$f":"1/6*I4*(4*K4*L4+J4*I4+40*I4)","v":{"v":61333.33333333333,"d":"61,333"}}]
["built_t","T 80 x 6, 50 x 6",80,6,50,6,780,{"$f":"C5*SQRT(360)/(D5-1)","v":{"v":303.5786553761644,"d":"303.6"}},80,6,50,6,780,{"$f":"G5/G4-1","v":{"v":0.19999999999999996,"d":"20%"}},{"$f":"1/6*I5*(4*K5*L5+J5*I5+40*I5)","v":{"v":65066.666666666664,"d":"65,067"}}]
["built_t","T 80 x 7, 50 x 7",80,7,50,7,910,{"v":252.98221281347037,"d":"253.0"},80,7,50,7,910,{"$f":"G6/G5-1","v":{"v":0.16666666666666674,"d":"17%"}},{"v":68800,"d":"68,800"}]
["built_t","T 100 x 6, 60 x 6",100,6,60,6,960,{"v":379.47331922020555,"d":"379.5"},100,6,60,6,960,{"v":0.05494505494505497,"d":"5%"},{"v":100666.66666666666,"d":"100,667"}]
["built_t","T 80 x 8, 50 x 8",80,8,50,8,1040,{"v":216.84189669726032,"d":"216.8"},80,8,50,8,1040,{"v":0.08333333333333326,"d":"8%"},{"v":72533.33333333333,"d":"72,533"}]
["built_t","T 100 x 7, 60 x 7",100,7,60,7,1120,{"v":316.22776601683796,"d":"316.2"},100,7,60,7,1120,{"v":0.07692307692307687,"d":"8%"},{"v":106333.33333333331,"d":"106,333"}]
["built_t","T 120 x 6, 70 x 6",120,6,70,6,1140,{"v":455.36798306424663,"d":"455.4"},120,6,70,6,1140,{"v":0.017857142857142794,"d":"2%"},{"v":144000,"d":"144,000"}]
["built_t","T 80 x 9, 50 x 9",80,9,50,9,1170,{"v":189.73665961010278,"d":"189.7"},80,9,50,9,1170,{"v":0.026315789473684292,"d":"3%"},{"v":76266.66666666666,"d":"76,267"}]
["built_t","T 100 x 8, 60 x 8",100,8,60,8,1280,{"v":271.05237087157536,"d":"271.1"},100,8,60,8,1280,{"v":0.09401709401709413,"d":"9%"},{"v":111999.99999999999,"d":"112,000"}]
["built_t","T 80 x 10, 50 x 10",80,10,50,10,1300,{"v":168.6548085423136,"d":"168.7"},80,10,50,10,1300,{"v":0.015625,"d":"2%"},{"v":80000,"d":"80,000"}]
["built_t","T 140 x 6, 80 x 6",140,6,80,6,1320,{"v":531.2626469082877,"d":"531.3"},140,6,80,6,1320,{"v":0.01538461538461533,"d":"2%"},{"v":195066.66666666666,"d":"195,067"}]
["built_t",{"$f":"CONCATENATE(\"T \",C15,\" x \",D15, \", \",E15,\" x \",F15)","v":"T 120 x 7, 70 x 7"},120,7,70,7,1330,{"v":379.4733192202055,"d":"379.5"},120,7,70,7,1330,{"v":7.575757575757569E-3,"d":"1%"},{"v":152000,"d":"152,000"}]
["built_t",{"$f":"CONCATENATE(\"T \",C16,\" x \",D16, \", \",E16,\" x \",F16)","v":"T 160 x 6, 90 x 6"},160,6,90,6,1500,{"v":607.1573107523288,"d":"607.2"},160,6,90,6,1500,{"v":0.1278195488721805,"d":"13%"},{"v":253866.66666666666,"d":"253,867"}]
["built_t","T 120 x 8, 70 x 8",120,8,70,8,1520,{"v":325.26284504589046,"d":"325.3"},120,8,70,8,1520,{"v":0.01333333333333342,"d":"1%"},{"v":160000,"d":"160,000"}]
["built_t","T 140 x 7, 80 x 7",140,7,80,7,1540,{"v":442.71887242357315,"d":"442.7"},140,7,80,7,1540,{"v":0.013157894736842035,"d":"1%"},{"v":205800,"d":"205,800"}]
["built_t","T 160 x 7, 90 x 7",160,7,90,7,1750,{"v":505.96442562694074,"d":"506.0"},160,7,90,7,1750,{"v":0.13636363636363646,"d":"14%"},{"v":267733.3333333333,"d":"267,733"}]
["built_t","T 140 x 8, 80 x 8",140,8,80,8,1760,{"v":379.47331922020555,"d":"379.5"},140,8,80,8,1760,{"v":0.005714285714285783,"d":"1%"},{"v":216533.3333333333,"d":"216,533"}]
["built_t","T 180 x 7, 100 x 7",180,7,100,7,1960,{"v":569.2099788303083,"d":"569.2"},180,7,100,7,1960,{"v":0.11363636363636354,"d":"11%"},{"v":337800,"d":"337,800"}]
["built_t","T 140 x 9, 80 x 9",140,9,80,9,1980,{"v":332.03915431767985,"d":"332.0"},140,9,80,9,1980,{"v":0.010204081632652962,"d":"1%"},{"v":227266.66666666666,"d":"227,267"}]
["built_t","T 160 x 8, 90 x 8",160,8,90,8,2000,{"v":433.68379339452065,"d":"433.7"},160,8,90,8,2000,{"v":0.010101010101010166,"d":"1%"},{"v":281600,"d":"281,600"}]
["built_t","T 200 x 7, 110 x 7",200,7,110,7,2170,{"v":632.4555320336759,"d":"632.5"},200,7,110,7,2170,{"v":0.08499999999999996,"d":"9%"},{"v":415999.99999999994,"d":"416,000"}]
["built_t","T 200 x 8, 110 x 8",200,8,110,8,2480,{"v":542.1047417431507,"d":"542.1"},200,8,110,8,2480,{"v":0.1428571428571428,"d":"14%"},{"v":437333.33333333326,"d":"437,333"}]
["built_t","T 180 x 9, 100 x 9",180,9,100,9,2520,{"v":426.9074841227312,"d":"426.9"},180,9,100,9,2520,{"v":0.016129032258064502,"d":"2%"},{"v":372600,"d":"372,600"}]
["built_t","T 220 x 8, 120 x 8",220,8,120,8,2720,{"v":596.3152159174658,"d":"596.3"},220,8,120,8,2720,{"v":0.0793650793650793,"d":"8%"},{"v":528000,"d":"528,000"}]
["built_t","T 200 x 9, 110 x 9",200,9,110,9,2790,{"v":474.3416490252569,"d":"474.3"},200,9,110,9,2790,{"v":0.025735294117646967,"d":"3%"},{"v":458666.6666666666,"d":"458,667"}]
["built_t","T 180 x 10, 100 x 10",180,10,100,10,2800,{"v":379.4733192202055,"d":"379.5"},180,10,100,10,2800,{"v":3.5842293906809264E-3,"d":"0%"},{"v":390000,"d":"390,000"}]
["built_t","T 220 x 9, 120 x 9",220,9,120,9,3060,{"v":521.7758139277826,"d":"521.8"},220,9,120,9,3060,{"v":0.09285714285714275,"d":"9%"},{"v":553666.6666666666,"d":"553,667"}]
["built_t","T 180 x 11, 100 x 11",180,11,100,11,3080,{"v":341.525987298185,"d":"341.5"},180,11,100,11,3080,{"v":0.006535947712418277,"d":"1%"},{"v":407400,"d":"407,400"}]
["built_t","T 200 x 10, 110 x 10",200,10,110,10,3100,{"v":421.63702135578393,"d":"421.6"},200,10,110,10,3100,{"v":0.006493506493506551,"d":"1%"},{"v":479999.99999999994,"d":"480,000"}]
["built_t","T 240 x 9, 130 x 9",240,9,130,9,3330,{"v":569.2099788303083,"d":"569.2"},240,9,130,9,3330,{"v":0.0741935483870968,"d":"7%"},{"v":657600,"d":"657,600"}]
["built_t","T 180 x 12, 100 x 12",180,12,100,12,3360,{"v":310.47817027107726,"d":"310.5"},180,12,100,12,3360,{"v":9.009009009008917E-3,"d":"1%"},{"v":424800,"d":"424,800"}]
["built_t","T 220 x 10, 120 x 10",220,10,120,10,3400,{"v":463.8007234913623,"d":"463.8"},220,10,120,10,3400,{"v":0.011904761904761862,"d":"1%"},{"v":579333.3333333333,"d":"579,333"}]
["built_t","T 200 x 11, 110 x 11",200,11,{"$f":"C36/2+10","v":110},{"$f":"D36","v":11},{"$f":"C36*D36+E36*F36","v":3410},{"v":379.47331922020555,"d":"379.5"},{"$f":"C36","v":200},{"$f":"D36","v":11},{"$f":"E36","v":110},{"$f":"F36","v":11},3410,{"v":0.002941176470588225,"d":"0%"},{"v":501333.33333333326,"d":"501,333"}]
["built_t",{"$f":"CONCATENATE(\"T \",C37,\" x \",D37, \", \",E37,\" x \",F37)","v":"T 240 x 10, 130 x 10"},240,10,130,10,3700,{"v":505.9644256269407,"d":"506.0"},240,10,130,10,3700,{"v":0.08504398826979465,"d":"9%"},{"v":688000,"d":"688,000"}]
["built_t","T 200 x 12, 110 x 12",200,12,110,12,3720,{"v":344.9757447456414,"d":"345.0"},200,12,110,12,3720,{"v":0.00540540540540535,"d":"1%"},{"v":522666.66666666657,"d":"522,667"}]
["built_t","T 220 x 11, 120 x 11",220,11,120,11,3740,{"v":417.42065114222606,"d":"417.4"},220,11,120,11,3740,{"v":0.005376344086021501,"d":"1%"},{"v":605000,"d":"605,000"}]
["built_t","T 260 x 10, 140 x 10",260,10,140,10,4000,{"v":548.1281277625191,"d":"548.1"},260,10,140,10,4000,{"v":0.06951871657754016,"d":"7%"},{"v":805999.9999999999,"d":"806,000"}]
["built_t",{"$f":"CONCATENATE(\"T \",C41,\" x \",D41, \", \",E41,\" x \",F41)","v":"T 240 x 11, 130 x 11"},240,11,130,11,4070,{"v":455.36798306424663,"d":"455.4"},240,11,130,11,4070,{"v":0.01750000000000007,"d":"2%"},{"v":718400,"d":"718,400"}]
["built_t",{"$f":"CONCATENATE(\"T \",C42,\" x \",D42, \", \",E42,\" x \",F42)","v":"T 280 x 10, 150 x 10"},280,10,150,10,4300,{"v":590.2918298980975,"d":"590.3"},280,10,150,10,4300,{"v":0.05651105651105648,"d":"6%"},{"v":933333.3333333333,"d":"933,333"}]
["built_t",{"$f":"CONCATENATE(\"T \",C43,\" x \",D43, \", \",E43,\" x \",F43)","v":"T 260 x 11, 140 x 11"},260,11,140,11,4400,{"v":493.3153149862672,"d":"493.3"},260,11,140,11,4400,{"v":0.023255813953488413,"d":"2%"},{"v":841533.3333333333,"d":"841,533"}]
["built_t","T 280 x 11, 150 x 11",280,11,150,11,4730,{"v":531.2626469082877,"d":"531.3"},280,11,150,11,4730,{"v":0.07499999999999996,"d":"8%"},{"v":974400,"d":"974,400"}]
["built_t","T 260 x 12, 140 x 12",260,12,140,12,4800,{"v":448.4684681693338,"d":"448.5"},260,12,140,12,4800,{"v":0.014799154334038,"d":"1%"},{"v":877066.6666666666,"d":"877,067"}]
["built_t","T 280 x 12, 150 x 12",280,12,150,12,5160,{"v":482.96604264389794,"d":"483.0"},280,12,150,12,5160,{"v":0.07499999999999996,"d":"8%"},{"v":1015466.6666666666,"d":"1,015,467"}]
["built_t","T 281 x 12, 150.5 x 12",281,12,{"v":150.5,"d":"151"},12,5178,{"v":484.6909213676261,"d":"484.7"},281,12,150.5,12,5178,{"v":3.4883720930232176E-3,"d":"0%"},{"v":1022652.6666666665,"d":"1,022,653"}]
["built_t","T 300 x 12, 160 x 12",300,12,160,12,5520,{"v":517.4636171184621,"d":"517.5"},300,12,160,12,5520,{"v":0.0660486674391656,"d":"7%"},{"v":1164000,"d":"1,164,000"}]
["built_t","T 260 x 14, 140 x 14",260,14,140,14,5600,{"v":379.47331922020555,"d":"379.5"},260,14,140,14,5600,{"v":0.01449275362318847,"d":"1%"},{"v":948133.3333333333,"d":"948,133"}]
["built_t","T 320 x 12, 170 x 12",320,12,170,12,5880,{"v":551.9611915930262,"d":"552.0"},320,12,170,12,5880,{"v":0.050000000000000044,"d":"5%"},{"v":1322666.6666666665,"d":"1,322,667"}]
["built_t","T 280 x 14, 150 x 14",280,14,150,14,6020,{"v":408.6635745448367,"d":"408.7"},280,14,150,14,6020,{"v":0.023809523809523725,"d":"2%"},{"v":1097600,"d":"1,097,600"}]
["built_t","T 260 x 16, 140 x 16",260,16,140,16,6400,{"v":328.87687665751145,"d":"328.9"},260,16,140,16,6400,{"v":0.06312292358803995,"d":"6%"},{"v":1019199.9999999999,"d":"1,019,200"}]
["built_t","T 300 x 14, 160 x 14",300,14,160,14,6440,{"v":437.8538298694679,"d":"437.9"},300,14,160,14,6440,{"v":0.006250000000000089,"d":"1%"},{"v":1258000,"d":"1,258,000"}]
["built_t","T 320 x 14, 170 x 14",320,14,170,14,6860,{"v":467.0440851940991,"d":"467.0"},320,14,170,14,6860,{"v":0.0652173913043479,"d":"7%"},{"v":1429333.3333333333,"d":"1,429,333"}]
["built_t","T 280 x 16, 150 x 16",280,16,150,16,6880,{"v":354.1750979388585,"d":"354.2"},280,16,150,16,6880,{"v":0.00291545189504383,"d":"0%"},{"v":1179733.3333333333,"d":"1,179,733"}]
["built_t","T 340 x 14, 180 x 14",340,14,180,14,7280,{"v":496.2343405187303,"d":"496.2"},340,14,180,14,7280,{"v":0.058139534883721034,"d":"6%"},{"v":1611600,"d":"1,611,600"}]
["built_t","T 300 x 16, 160 x 16",300,16,160,16,7360,{"v":379.47331922020555,"d":"379.5"},300,16,160,16,7360,{"v":0.01098901098901095,"d":"1%"},{"v":1352000,"d":"1,352,000"}]
["built_t","T 360 x 14, 190 x 14",360,14,190,14,7700,{"v":525.4245958433614,"d":"525.4"},360,14,190,14,7700,{"v":0.04619565217391308,"d":"5%"},{"v":1804800,"d":"1,804,800"}]
["built_t","T 320 x 16, 170 x 16",320,16,170,16,7840,{"v":404.7715405015526,"d":"404.8"},320,16,170,16,7840,{"v":0.018181818181818077,"d":"2%"},{"v":1535999.9999999998,"d":"1,536,000"}]
["built_t","T 380 x 14, 200 x 14",380,14,200,14,8120,{"v":554.6148511679927,"d":"554.6"},380,14,200,14,8120,{"v":0.03571428571428581,"d":"4%"},{"v":2008933.3333333333,"d":"2,008,933"}]
["built_t","T 300 x 18, 160 x 18",300,18,160,18,8280,{"v":334.8293993119461,"d":"334.8"},300,18,160,18,8280,{"v":0.019704433497536922,"d":"2%"},{"v":1446000,"d":"1,446,000"}]
["built_t","T 340 x 16, 180 x 16",340,16,180,16,8320,{"v":430.06976178289955,"d":"430.1"},340,16,180,16,8320,{"v":0.004830917874396157,"d":"0%"},{"v":1731733.3333333333,"d":"1,731,733"}]
["built_t","T 360 x 16, 190 x 16",360,16,190,16,8800,{"v":455.36798306424663,"d":"455.4"},360,16,190,16,8800,{"v":0.05769230769230771,"d":"6%"},{"v":1939200,"d":"1,939,200"}]
["built_t","T 320 x 18, 170 x 18",320,18,170,18,8820,{"v":357.1513592660758,"d":"357.2"},320,18,170,18,8820,{"v":0.002272727272727204,"d":"0%"},{"v":1642666.6666666665,"d":"1,642,667"}]
["built_t","T 380 x 16, 200 x 16",380,16,{"$f":"MIN(C65/2+10,200)","v":200},16,9280,{"v":480.66620434559366,"d":"480.7"},380,16,200,16,9280,{"v":0.05215419501133778,"d":"5%"},{"v":2158400,"d":"2,158,400"}]
["built_t",{"$f":"CONCATENATE(\"T \",C66,\" x \",D66, \", \",E66,\" x \",F66)","v":"T 340 x 18, 180 x 18"},340,18,180,18,9360,{"v":379.4733192202055,"d":"379.5"},340,18,180,18,9360,{"v":0.008620689655172376,"d":"1%"},{"v":1851866.6666666665,"d":"1,851,867"}]
["built_t","T 400 x 16, 200 x 16",400,16,200,16,9600,{"v":505.9644256269407,"d":"506.0"},400,16,200,16,9600,{"v":0.02564102564102555,"d":"3%"},{"v":2346666.6666666665,"d":"2,346,667"}]
["built_t","T 320 x 20, 170 x 20",320,20,170,{"$f":"D68","v":20},{"$f":"C68*D68+E68*F68","v":9800},{"v":319.556479343331,"d":"319.6"},{"$f":"C68","v":320},{"$f":"D68","v":20},{"$f":"E68","v":170},{"$f":"F68","v":20},{"$f":"I68*J68+K68*L68","v":9800},{"v":0.02083333333333326,"d":"2%"},{"v":1749333.3333333333,"d":"1,749,333"}]
["built_t","T 360 x 18, 190 x 18",360,18,190,18,9900,{"$f":"C69*SQRT(360)/(D69-1)","v":{"v":401.79527917433523,"d":"401.8"}},360,18,190,18,9900,{"v":0.010204081632652962,"d":"1%"},{"$f":"1/6*I69*(4*K69*L69+J69*I69+40*I69)","v":{"v":2073600,"d":"2,073,600"}}]
["built_t","T 420 x 16, 200 x 16",420,16,200,16,9920,{"v":531.2626469082877,"d":"531.3"},420,16,200,16,9920,{"$f":"G70/G69-1","v":{"v":0.002020202020202033,"d":"0%"}},{"v":2542400,"d":"2,542,400"}]
["built_t","T 440 x 16, 200 x 16",440,16,200,16,10240,{"v":556.5608681896348,"d":"556.6"},440,16,200,16,10240,{"v":0.032258064516129004,"d":"3%"},{"v":2745600,"d":"2,745,600"}]
["built_t","T 340 x 20, 180 x 20",340,20,180,20,10400,{"v":339.52875930228913,"d":"339.5"},340,20,180,20,10400,{"v":0.015625,"d":"2%"},{"v":1972000,"d":"1,972,000"}]
["built_t",{"$f":"CONCATENATE(\"T \",C73,\" x \",D73, \", \",E73,\" x \",F73)","v":"T 380 x 18, 200 x 18"},380,18,200,18,10440,{"v":424.117239128465,"d":"424.1"},380,18,200,18,10440,{"v":3.8461538461538325E-3,"d":"0%"},{"v":2307866.6666666665,"d":"2,307,867"}]
["built_t","T 400 x 18, 200 x 18",400,18,200,18,10800,{"v":446.43919908259477,"d":"446.4"},400,18,200,18,10800,{"v":0.034482758620689724,"d":"3%"},{"v":2506666.6666666665,"d":"2,506,667"}]
["built_t","T 360 x 20, 190 x 20",360,20,190,20,11000,{"v":359.50103926124734,"d":"359.5"},360,20,190,20,11000,{"v":0.0185185185185186,"d":"2%"},{"v":2208000,"d":"2,208,000"}]
["built_t",{"$f":"CONCATENATE(\"T \",C76,\" x \",D76, \", \",E76,\" x \",F76)","v":"T 420 x 18, 200 x 18"},420,18,200,18,11160,{"v":468.7611590367245,"d":"468.8"},420,18,200,18,11160,{"v":0.014545454545454639,"d":"1%"},{"v":2713200,"d":"2,713,200"}]
["built_t","T 340 x 22, 180 x 22",340,22,180,22,11440,{"v":307.1926869877854,"d":"307.2"},340,22,180,22,11440,{"v":0.02508960573476693,"d":"3%"},{"v":2092133.3333333333,"d":"2,092,133"}]
["built_t","T 440 x 18, 200 x 18",440,18,200,18,11520,{"v":491.0831189908542,"d":"491.1"},440,18,200,18,11520,{"v":0.006993006993007089,"d":"1%"},{"v":2927466.6666666665,"d":"2,927,467"}]
["built_t","T 380 x 20, 200 x 20",380,20,200,20,11600,{"v":379.4733192202055,"d":"379.5"},380,20,200,20,11600,{"v":0.00694444444444442,"d":"1%"},{"v":2457333.333333333,"d":"2,457,333"}]
["built_t","T 460 x 18, 200 x 18",460,18,200,18,11880,{"v":513.4050789449839,"d":"513.4"},460,18,200,18,11880,{"v":0.024137931034482696,"d":"2%"},{"v":3149466.666666666,"d":"3,149,467"}]
["built_t","T 400 x 20, 200 x 20",400,20,200,20,12000,{"v":399.4455991791637,"d":"399.4"},400,20,200,20,12000,{"v":0.010101010101010166,"d":"1%"},{"v":2666666.6666666665,"d":"2,666,667"}]
["built_t","T 360 x 22, 190 x 22",360,22,190,22,12100,{"v":325.26284504589046,"d":"325.3"},360,22,190,22,12100,{"v":0.008333333333333304,"d":"1%"},{"v":2342400,"d":"2,342,400"}]
["built_t","T 480 x 18, 200 x 18",480,18,200,18,12240,{"v":535.7270388991137,"d":"535.7"},480,18,200,18,12240,{"v":0.011570247933884392,"d":"1%"},{"v":3379200,"d":"3,379,200"}]
["built_t","T 420 x 20, 200 x 20",420,20,200,20,12400,{"v":419.4178791381219,"d":"419.4"},420,20,200,20,12400,{"v":0.013071895424836555,"d":"1%"},{"v":2884000,"d":"2,884,000"}]
["built_t","T 380 x 22, 200 x 22",380,22,200,22,12760,{"v":343.33300310399545,"d":"343.3"},380,22,200,22,12760,{"v":0.029032258064516148,"d":"3%"},{"v":2606800,"d":"2,606,800"}]
["built_t",{"$f":"CONCATENATE(\"T \",C86,\" x \",D86, \", \",E86,\" x \",F86)","v":"T 440 x 20, 200 x 20"},440,20,200,20,12800,{"v":439.3901590970801,"d":"439.4"},440,20,200,20,12800,{"v":3.1347962382444194E-3,"d":"0%"},{"v":3109333.333333333,"d":"3,109,333"}]
["built_t","T 360 x 24, 190 x 24",360,24,190,24,13200,{"v":296.97911938972607,"d":"297.0"},360,24,190,24,13200,{"v":0.03125,"d":"3%"},{"v":2476800,"d":"2,476,800"}]
["built_t","T 400 x 22, 200 x 22",400,22,200,22,13200,{"v":361.4031611621005,"d":"361.4"},400,22,200,22,13200,{"v":0,"d":"0%"},{"v":2826666.666666666,"d":"2,826,667"}]
["built_t","T 460 x 20, 200 x 20",460,20,200,20,13200,{"v":459.3624390560382,"d":"459.4"},460,20,200,20,13200,{"v":0,"d":"0%"},{"v":3342666.666666666,"d":"3,342,667"}]
["built_t","T 420 x 22, 200 x 22",420,22,200,22,13640,{"v":379.47331922020555,"d":"379.5"},420,22,200,22,13640,{"v":0.03333333333333344,"d":"3%"},{"v":3054800,"d":"3,054,800"}]
["built_t","T 500 x 20, 200 x 20",500,20,200,20,14000,{"v":499.30699897395465,"d":"499.3"},500,20,200,20,14000,{"v":0.02639296187683282,"d":"3%"},{"v":3833333.333333333,"d":"3,833,333"}]
["built_t","T 440 x 22, 200 x 22",440,22,200,22,14080,{"v":397.54347727831055,"d":"397.5"},440,22,200,22,14080,{"v":0.005714285714285783,"d":"1%"},{"v":3291200,"d":"3,291,200"}]
["built_t","T 400 x 24, 200 x 24",400,24,200,24,14400,{"v":329.97679932191784,"d":"330.0"},400,24,200,24,14400,{"v":0.022727272727272707,"d":"2%"},{"v":2986666.666666666,"d":"2,986,667"}]
["built_t","T 460 x 22, 200 x 22",460,22,200,22,14520,{"v":415.61363533641554,"d":"415.6"},460,22,200,22,14520,{"v":0.008333333333333304,"d":"1%"},{"v":3535866.666666666,"d":"3,535,867"}]
["built_t",{"$f":"CONCATENATE(\"T \",C95,\" x \",D95, \", \",E95,\" x \",F95)","v":"T 540 x 20, 200 x 20"},540,20,200,20,14800,{"v":539.251558891871,"d":"539.3"},540,20,200,20,14800,{"v":0.019283746556473913,"d":"2%"},{"v":4356000,"d":"4,356,000"}]
["built_t",{"$f":"CONCATENATE(\"T \",C96,\" x \",D96, \", \",E96,\" x \",F96)","v":"T 420 x 24, 200 x 24"},420,24,200,24,14880,{"v":346.4756392880137,"d":"346.5"},420,24,200,24,14880,{"v":0.00540540540540535,"d":"1%"},{"v":3225600,"d":"3,225,600"}]
["built_t","T 440 x 24, 200 x 24",440,24,{"$f":"MIN(C97/2+10,200)","v":200},24,15360,{"v":362.9744792541096,"d":"363.0"},440,24,200,24,15360,{"v":0.032258064516129004,"d":"3%"},{"v":3473066.6666666665,"d":"3,473,067"}]
["built_t","T 500 x 22, 200 x 22",500,22,200,22,15400,{"v":451.75395145262564,"d":"451.8"},500,22,200,22,15400,{"v":2.6041666666667407E-3,"d":"0%"},{"v":4050000,"d":"4,050,000"}]
["built_t","T 400 x 26, 200 x 26",400,26,200,26,15600,{"v":303.5786553761644,"d":"303.6"},400,26,200,26,15600,{"v":0.01298701298701288,"d":"1%"},{"v":3146666.666666666,"d":"3,146,667"}]
["built_t","T 460 x 24, 200 x 24",460,24,200,{"$f":"D100","v":24},{"$f":"C100*D100+E100*F100","v":15840},{"v":379.4733192202055,"d":"379.5"},{"$f":"C100","v":460},{"$f":"D100","v":24},{"$f":"E100","v":200},{"$f":"F100","v":24},15840,{"v":0.01538461538461533,"d":"2%"},{"v":3729066.666666666,"d":"3,729,067"}]
["built_t","T 420 x 26, 200 x 26",420,26,200,26,16120,{"v":318.75758814497266,"d":"318.8"},420,26,200,26,16120,{"v":0.017676767676767735,"d":"2%"},{"v":3396400,"d":"3,396,400"}]
["built_t","T 540 x 22, 200 x 22",540,22,200,22,16280,{"v":487.8942675688357,"d":"487.9"},540,22,200,22,16280,{"v":0.00992555831265518,"d":"1%"},{"v":4597200,"d":"4,597,200"}]
["built_t",{"$f":"CONCATENATE(\"T \",C103,\" x \",D103, \", \",E103,\" x \",F103)","v":"T 440 x 26, 200 x 26"},440,26,200,26,16640,{"v":333.93652091378084,"d":"333.9"},440,26,200,26,16640,{"v":0.02211302211302213,"d":"2%"},{"v":3654933.333333333,"d":"3,654,933"}]
["built_t",{"$f":"CONCATENATE(\"T \",C104,\" x \",D104, \", \",E104,\" x \",F104)","v":"T 500 x 24, 200 x 24"},500,24,200,24,16800,{"v":412.4709991523973,"d":"412.5"},500,24,200,24,16800,{"v":0.009615384615384581,"d":"1%"},{"v":4266666.666666666,"d":"4,266,667"}]
["built_t",{"$f":"CONCATENATE(\"T \",C105,\" x \",D105, \", \",E105,\" x \",F105)","v":"T 460 x 26, 200 x 26"},460,26,200,26,17160,{"v":349.1154536825891,"d":"349.1"},460,26,200,26,17160,{"v":0.021428571428571352,"d":"2%"},{"v":3922266.666666666,"d":"3,922,267"}]
["built_t",{"$f":"CONCATENATE(\"T \",C106,\" x \",D106, \", \",E106,\" x \",F106)","v":"T 580 x 22, 200 x 22"},580,22,200,22,17160,{"v":524.0345836850457,"d":"524.0"},580,22,200,22,17160,{"v":0,"d":"0%"},{"v":5177466.666666666,"d":"5,177,467"}]
["built_t","T 420 x 28, 200 x 28",420,28,200,28,17360,{"v":295.14591494904874,"d":"295.1"},420,28,200,28,17360,{"v":0.011655011655011593,"d":"1%"},{"v":3567200,"d":"3,567,200"}]
["built_t","T 540 x 24, 200 x 24",540,24,200,24,17760,{"v":445.4686790845891,"d":"445.5"},540,24,200,24,17760,{"v":0.02304147465437789,"d":"2%"},{"v":4838400,"d":"4,838,400"}]
["built_t","T 440 x 28, 200 x 28",440,28,200,28,17920,{"v":309.20048232757483,"d":"309.2"},440,28,200,28,17920,{"v":9.009009009008917E-3,"d":"1%"},{"v":3836799.9999999995,"d":"3,836,800"}]
["built_t","T 500 x 26, 200 x 26",500,26,200,26,18200,{"v":379.4733192202055,"d":"379.5"},500,26,200,26,18200,{"v":0.015625,"d":"2%"},{"v":4483333.333333333,"d":"4,483,333"}]
["built_t","T 580 x 24, 200 x 24",580,24,200,24,18720,{"v":478.4663590167809,"d":"478.5"},580,24,200,24,18720,{"v":0.02857142857142847,"d":"3%"},{"v":5444266.666666666,"d":"5,444,267"}]
["built_t",{"$f":"CONCATENATE(\"T \",C112,\" x \",D112, \", \",E112,\" x \",F112)","v":"T 540 x 26, 200 x 26"},540,26,200,26,19240,{"v":409.831184757822,"d":"409.8"},540,26,200,26,19240,{"v":0.02777777777777768,"d":"3%"},{"v":5079600,"d":"5,079,600"}]
["built_t",{"$f":"CONCATENATE(\"T \",C113,\" x \",D113, \", \",E113,\" x \",F113)","v":"T 450 x 30, 200 x 30"},450,30,200,30,19500,{"v":294.4189545674009,"d":"294.4"},450,30,200,30,19500,{"v":0.013513513513513598,"d":"1%"},{"v":4162500,"d":"4,162,500"}]
["built_t",{"$f":"CONCATENATE(\"T \",C114,\" x \",D114, \", \",E114,\" x \",F114)","v":"T 500 x 28, 200 x 28"},500,28,200,28,19600,{"v":351.36418446315326,"d":"351.4"},500,28,200,28,19600,{"v":5.12820512820511E-3,"d":"1%"},{"v":4700000,"d":"4,700,000"}]
["built_t",{"$f":"CONCATENATE(\"T \",C115,\" x \",D115, \", \",E115,\" x \",F115)","v":"T 620 x 24, 200 x 24"},620,24,200,24,19680,{"v":511.4640389489727,"d":"511.5"},620,24,200,24,19680,{"v":0.004081632653061273,"d":"0%"},{"v":6084266.666666666,"d":"6,084,267"}]
["built_t",{"$f":"CONCATENATE(\"T \",C116,\" x \",D116, \", \",E116,\" x \",F116)","v":"T 580 x 26, 200 x 26"},580,26,200,26,20280,{"v":440.18905029543845,"d":"440.2"},580,26,200,26,20280,{"v":0.030487804878048808,"d":"3%"},{"v":5711066.666666666,"d":"5,711,067"}]
["built_t","T 660 x 24, 200 x 24",660,24,200,24,20640,{"v":544.4617188811644,"d":"544.5"},660,24,200,24,20640,{"v":0.01775147928994092,"d":"2%"},{"v":6758400,"d":"6,758,400"}]
["built_t",{"$f":"CONCATENATE(\"T \",C118,\" x \",D118, \", \",E118,\" x \",F118)","v":"T 620 x 26, 200 x 26"},620,26,200,26,21320,{"v":470.54691583305487,"d":"470.5"},620,26,200,26,21320,{"v":0.032945736434108586,"d":"3%"},{"v":6377733.333333333,"d":"6,377,733"}]
["built_t","T 550 x 28, 200 x 30",550,28,200,30,21400,{"v":386.50060290946857,"d":"386.5"},550,28,200,30,21400,{"v":3.7523452157599557E-3,"d":"0%"},{"v":5628333.333333333,"d":"5,628,333"}]
["built_t","T 500 x 30, 200 x 35",500,30,200,35,22000,{"v":327.1321717415565,"d":"327.1"},500,30,200,35,22000,{"v":0.028037383177569986,"d":"3%"},{"v":5250000,"d":"5,250,000"}]
["built_t","T 660 x 26, 200 x 26",660,26,200,{"$f":"D121","v":26},22360,{"v":500.9047813706713,"d":"500.9"},660,26,200,26,22360,{"v":0.016363636363636358,"d":"2%"},{"v":7079600,"d":"7,079,600"}]
["built_t","T 500 x 32, 200 x 32",500,32,200,{"$f":"D122","v":32},22400,{"v":306.0268703388754,"d":"306.0"},500,32,200,32,22400,{"v":1.7889087656528524E-3,"d":"0%"},{"v":5133333.333333333,"d":"5,133,333"}]
["built_t","T 700 x 26, 200 x 26",700,26,200,{"$f":"D123","v":26},23400,{"v":531.2626469082877,"d":"531.3"},700,26,200,26,23400,{"v":0.044642857142857206,"d":"4%"},{"v":7816666.666666666,"d":"7,816,667"}]
["built_t","T 550 x 30, 200 x 35",550,30,200,35,23500,{"v":359.84538891571214,"d":"359.8"},550,30,200,35,23500,{"v":0.004273504273504258,"d":"0%"},{"v":6095833.333333333,"d":"6,095,833"}]
["built_t","T 600 x 28, 200 x 35",600,28,200,35,23800,{"v":421.63702135578393,"d":"421.6"},600,28,200,35,23800,{"v":0.012765957446808418,"d":"1%"},{"v":6880000,"d":"6,880,000"}]
["built_t","T 550 x 32, 200 x 35",550,32,200,35,24600,{"v":336.6295573727629,"d":"336.6"},550,32,200,35,24600,{"v":0.03361344537815136,"d":"3%"},{"v":6196666.666666666,"d":"6,196,667"}]
["built_t","T 650 x 28, 200 x 35",650,28,200,35,25200,{"v":456.77343980209923,"d":"456.8"},650,28,200,35,25200,{"v":0.024390243902439046,"d":"2%"},{"v":7821666.666666666,"d":"7,821,667"}]
["built_t","T 550 x 34, 200 x 35",550,34,200,35,25700,{"v":316.2277660168379,"d":"316.2"},550,34,200,35,25700,{"v":0.01984126984126977,"d":"2%"},{"v":6297499.999999999,"d":"6,297,500"}]
["built_t","T 600 x 30, 200 x 40",600,30,{"$f":"MIN(C129/2+10,200)","v":200},40,26000,{"v":392.5586060898678,"d":"392.6"},600,30,200,40,26000,{"v":0.011673151750972721,"d":"1%"},{"v":7400000,"d":"7,400,000"}]
["built_t","T 600 x 32, 200 x 35",600,32,200,35,26200,{"v":367.2322444066505,"d":"367.2"},600,32,200,35,26200,{"v":7.692307692307665E-3,"d":"1%"},{"v":7120000,"d":"7,120,000"}]
["built_t","T 700 x 28, 200 x 35",700,28,200,35,26600,{"v":491.90985824841454,"d":"491.9"},700,28,200,35,26600,{"v":0.01526717557251911,"d":"2%"},{"v":8820000,"d":"8,820,000"}]
["built_t","T 600 x 34, 200 x 35",600,34,200,35,{"$f":"C132*D132+E132*F132","v":27400},{"v":344.9757447456414,"d":"345.0"},{"$f":"C132","v":600},{"$f":"D132","v":34},{"$f":"E132","v":200},{"$f":"F132","v":35},{"$f":"I132*J132+K132*L132","v":27400},{"v":0.03007518796992481,"d":"3%"},{"v":7240000,"d":"7,240,000"}]
["built_t","T 650 x 30, 200 x 40",650,30,200,40,27500,{"$f":"C133*SQRT(360)/(D133-1)","v":{"v":425.27182326402345,"d":"425.3"}},650,30,200,40,27500,{"v":3.6496350364962904E-3,"d":"0%"},{"$f":"1/6*I133*(4*K133*L133+J133*I133+40*I133)","v":{"v":8395833.333333332,"d":"8,395,833"}}]
["built_t","T 750 x 28, 200 x 35",750,28,200,35,28000,{"v":527.04627669473,"d":"527.0"},750,28,200,35,28000,{"$f":"G134/G133-1","v":{"v":0.018181818181818077,"d":"2%"}},{"v":9875000,"d":"9,875,000"}]
["built_t","T 650 x 32, 200 x 40",650,32,200,40,28800,{"v":397.83493144053807,"d":"397.8"},650,32,200,40,28800,{"v":0.02857142857142847,"d":"3%"},{"v":8536666.666666666,"d":"8,536,667"}]
["built_t","T 700 x 30, 200 x 40",700,30,200,40,29000,{"v":457.98504043817906,"d":"458.0"},700,30,200,40,29000,{"v":0.00694444444444442,"d":"1%"},{"v":9450000,"d":"9,450,000"}]
["built_t",{"$f":"CONCATENATE(\"T \",C137,\" x \",D137, \", \",E137,\" x \",F137)","v":"T 650 x 34, 200 x 35"},650,34,200,35,29100,{"v":373.72372347444485,"d":"373.7"},650,34,200,35,29100,{"v":3.4482758620688614E-3,"d":"0%"},{"v":8244166.666666666,"d":"8,244,167"}]
["built_t",{"$f":"CONCATENATE(\"T \",C138,\" x \",D138, \", \",E138,\" x \",F138)","v":"T 700 x 32, 200 x 40"},700,32,200,40,30400,{"v":428.43761847442556,"d":"428.4"},700,32,200,40,30400,{"v":0.04467353951890041,"d":"4%"},{"v":9613333.333333332,"d":"9,613,333"}]
["built_t",{"$f":"CONCATENATE(\"T \",C139,\" x \",D139, \", \",E139,\" x \",F139)","v":"T 750 x 30, 200 x 40"},750,30,200,40,30500,{"v":490.69825761233477,"d":"490.7"},750,30,200,40,30500,{"v":0.00328947368421062,"d":"0%"},{"v":10562500,"d":"10,562,500"}]
["built_t",{"$f":"CONCATENATE(\"T \",C140,\" x \",D140, \", \",E140,\" x \",F140)","v":"T 700 x 34, 200 x 40"},700,34,200,40,31800,{"v":402.47170220324824,"d":"402.5"},700,34,200,40,31800,{"v":0.042622950819672045,"d":"4%"},{"v":9776666.666666666,"d":"9,776,667"}]
["built_t",{"$f":"CONCATENATE(\"T \",C141,\" x \",D141, \", \",E141,\" x \",F141)","v":"T 750 x 32, 200 x 40"},750,32,200,40,32000,{"v":459.04030550831317,"d":"459.0"},750,32,200,40,32000,{"v":6.2893081761006275E-3,"d":"1%"},{"v":10750000,"d":"10,750,000"}]
["built_t","T 800 x 30, 200 x 40",800,30,200,40,32000,{"v":523.4114747864904,"d":"523.4"},800,30,200,40,32000,{"v":0,"d":"0%"},{"v":11733333.333333332,"d":"11,733,333"}]
["built_t","T 750 x 34, 200 x 40",750,34,200,40,33500,{"v":431.21968093205174,"d":"431.2"},750,34,200,40,33500,{"v":0.046875,"d":"5%"},{"v":10937500,"d":"10,937,500"}]
["built_t","T 800 x 32, 200 x 40",800,32,200,40,33600,{"v":489.64299254220066,"d":"489.6"},800,32,200,40,33600,{"v":2.9850746268655914E-3,"d":"0%"},{"v":11946666.666666664,"d":"11,946,667"}]
["built_t",{"$f":"CONCATENATE(\"T \",C145,\" x \",D145, \", \",E145,\" x \",F145)","v":"T 800 x 34, 200 x 40"},800,34,200,40,35200,{"v":459.9676596608552,"d":"460.0"},800,34,200,40,35200,{"v":0.04761904761904767,"d":"5%"},{"v":12159999.999999998,"d":"12,160,000"}]
["built_t","T 850 x 32, 200 x 40",850,32,200,40,35200,{"v":520.2456795760883,"d":"520.2"},850,32,200,40,35200,{"v":0,"d":"0%"},{"v":13203333.333333332,"d":"13,203,333"}]
["built_t","T 850 x 34, 200 x 40",850,34,200,40,36900,{"v":488.71563838965864,"d":"488.7"},850,34,200,40,36900,{"v":0.048295454545454586,"d":"5%"},{"v":13444166.666666666,"d":"13,444,167"}]
["built_t","T 900 x 34, 200 x 40",900,34,200,40,38600,{"v":517.4636171184621,"d":"517.5"},900,34,200,40,38600,{"v":0.046070460704606964,"d":"5%"},{"v":14790000,"d":"14,790,000"}]
["built_t","T 950 x 35, 200 x 40",950,35,{"$f":"MIN(C149/2+10,200)","v":200},40,{"$f":"C149*D149+E149*F149","v":41250},{"$f":"C149*SQRT(360)/(D149-1)","v":{"v":530.1465489105813,"d":"530.1"}},{"$f":"C149","v":950},35,200,40,41250,{"$f":"G149/G148-1","v":{"v":0.06865284974093266,"d":"7%"}},{"v":16347916.666666664,"d":"16,347,917"}]
["built_t","T 1000 x 36, 200 x 40",1000,36,200,40,44000,{"v":542.1047417431507,"d":"542.1"},1000,36,200,40,44000,{"v":0.06666666666666665,"d":"7%"},{"v":18000000,"d":"18,000,000"}]
["built_t","T 1200 x 38, 200 x 40",1200,38,200,40,53600,{"v":615.362139276009,"d":"615.4"},1200,38,200,40,53600,{"v":0.21818181818181825,"d":"22%"},{"$f":"1/6*I151*(4*K151*L151+J151*I151+40*I151)","v":{"v":25120000,"d":"25,120,000"}}]
["built_t","T 1400 x 40, 200 x 40",1400,40,200,40,64000,{"v":681.1059575747279,"d":"681.1"},1400,40,200,40,64000,{"v":0.19402985074626855,"d":"19%"},{"v":33600000,"d":"33,600,000"}]
["built_t","T 1600 x 42, 200 x 40",1600,42,200,40,75200,{"v":740.4357448199132,"d":"740.4"},1600,42,200,40,75200,{"v":0.17500000000000004,"d":"18%"},{"v":43519999.99999999,"d":"43,520,000"}]
["built_t","T 1800 x 44, 200 x 40",1800,44,200,40,87200,{"v":794.2464820888023,"d":"794.2"},1800,44,200,40,87200,{"v":0.15957446808510634,"d":"16%"},{"v":54960000,"d":"54,960,000"}]
["built_t","T 2000 x 50, 200 x 41",2000,50,{"$f":"MIN(C155/2+10,200)","v":200},41,108200,{"v":774.4353453473582,"d":"774.4"},2000,50,200,41,108200,{"v":0.24082568807339455,"d":"24%"},{"v":70933333.33333333,"d":"70,933,333"}]
["built_t","T 2200 x 55, 200 x 42",2200,55,{"$f":"MIN(C156/2+10,200)","v":200},42,129400,{"v":773.0012058189371,"d":"773.0"},2200,55,200,42,129400,{"v":0.1959334565619224,"d":"20%"},{"v":88953333.33333333,"d":"88,953,333"}]
[null,"outside range",{"$nulls":6},10000,100,100,100]

{"sheet":"any","index":12,"n_rows":514,"n_cols":15,"rows_kept":514}
[]
[null,null,"h","tw",null,null,"A",null,"hw","tw",null,null,"A",null,"Ze(est)"]
[{"$nulls":8},"mm","mm",{"$nulls":4},"mm3"]
["flat","F 60 x 5",60,6,{"v":227.68399153212331,"d":"228"},null,{"$f":"C4*D4","v":360},{"$f":"C4*SQRT(360)/(D4-1)","v":{"v":227.68399153212331,"d":"227.7"}},{"$f":"C4","v":60},{"$f":"D4","v":6},0,0,360,null,{"$f":"1/6*I4*(4*K4*L4+J4*I4+40*I4)","v":{"v":27600,"d":"27,600"}}]
["HP","HP 60*4.0",60,4,17,null,{"$f":"C5*D5","v":240},{"$f":"C5*SQRT(360)/D5","v":{"v":284.60498941515414,"d":"284.6"}},50.38,4,17,9.62,{"v":365.06,"d":"365"},{"$f":"M5/M4-1","v":{"v":0.014055555555555488,"d":"1%"}},{"v":24105.8224,"d":"24,106"}]
["half_I","IPE 100 A_half",98,3.6,55,4.7,352.8,{"$f":"C6*SQRT(360)/D6","v":{"v":516.5053511608353,"d":"516.5"}},44.3,3.6,55,4.7,{"v":417.98,"d":"418"},{"v":0.14496247192242384,"d":"14%"},{"v":21895.127333333334,"d":"21,895"}]
["flat","F 60 x 6",60,7,{"v":189.73665961010278,"d":"190"},{"$f":"C7*D7","v":420},420,{"$f":"C7*SQRT(360)/(D7-1)","v":{"v":189.73665961010275,"d":"189.7"}},{"$f":"C7","v":60},{"$f":"D7","v":7},0,0,420,{"v":4.8327671180439236E-3,"d":"0%"},{"v":28200,"d":"28,200"}]
["HP","HP 60*5.0",60,5,18,null,300,{"$f":"C8*SQRT(360)/D8","v":{"v":227.68399153212331,"d":"227.7"}},50.38,5,18,9.62,{"v":425.06,"d":"425"},{"v":0.012047619047619085,"d":"1%"},{"v":24851.9502,"d":"24,852"}]
["flat","F 60 x 7",60,8,{"v":162.63142252294523,"d":"163"},{"$f":"C9*D9","v":480},480,{"$f":"C9*SQRT(360)/(D9-1)","v":{"v":162.63142252294523,"d":"162.6"}},{"$f":"C9","v":60},{"$f":"D9","v":8},0,0,480,{"v":0.12925234084599824,"d":"13%"},{"v":28800,"d":"28,800"}]
["HP","HP 60*6.0",60,6,19,null,360,{"$f":"C10*SQRT(360)/D10","v":{"v":189.73665961010275,"d":"189.7"}},50.38,6,19,9.62,{"v":485.06,"d":"485"},{"v":0.010541666666666671,"d":"1%"},{"v":25598.077999999998,"d":"25,598"}]
["half_I","IPE 100_half",100,4.1,55,5.7,409.99999999999994,{"$f":"C11*SQRT(360)/D11","v":{"v":462.7723405124458,"d":"462.8"}},44.3,4.1,55,5.7,{"v":495.13,"d":"495"},{"v":0.020760318311136672,"d":"2%"},{"v":23683.0015,"d":"23,683"}]
["half_I","IPE 120 A_half",118,3.8,64,5.1,448.4,{"$f":"C12*SQRT(360)/D12","v":{"v":589.1822587892665,"d":"589.2"}},53.9,3.8,64,5.1,{"v":531.22,"d":"531"},{"v":0.07288994809443983,"d":"7%"},{"v":32936.672999999995,"d":"32,937"}]
["HP","HP 80*5.0",80,5,19,null,400,{"$f":"C13*SQRT(360)/D13","v":{"v":303.5786553761644,"d":"303.6"}},69.64,5,19,10.36,{"v":545.04,"d":"545"},{"v":0.02601558676254645,"d":"3%"},{"v":45511.59706666666,"d":"45,512"}]
["cropped_I","IPE 100 A_cropped",98,3.6,55,4.7,352.8,{"$f":"C14*SQRT(360)/D14","v":{"v":516.5053511608353,"d":"516.5"}},81.6,3.6,55,4.7,{"v":552.26,"d":"552"},{"v":0.013246734184646947,"d":"1%"},{"v":62447.935999999994,"d":"62,448"}]
["flat","F 80 x 6",80,7,{"v":243.947133784418,"d":"244"},{"$f":"C15*D15","v":560},560,{"$f":"C15*SQRT(360)/(D15-1)","v":{"v":252.98221281347037,"d":"253.0"}},{"$f":"C15","v":80},{"$f":"D15","v":7},0,0,560,{"v":0.014015137797414257,"d":"1%"},{"v":50133.33333333333,"d":"50,133"}]
["HP","HP 80*6.0",80,6,20,null,480,{"$f":"C16*SQRT(360)/D16","v":{"v":252.98221281347037,"d":"253.0"}},69.64,6,20,10.36,{"v":625.04,"d":"625"},{"v":0.1161428571428571,"d":"12%"},{"v":46800.86559999999,"d":"46,801"}]
["half_I","IPE 120_half",120,4.4,64,6.3,528,{"$f":"C17*SQRT(360)/D17","v":{"v":517.463617118462,"d":"517.5"}},53.7,4.4,64,6.3,{"v":639.48,"d":"639"},{"v":0.02310252143862801,"d":"2%"},{"v":35773.865999999995,"d":"35,774"}]
["flat","F 80 x 7",80,8,{"v":216.8418966972603,"d":"217"},{"$f":"C18*D18","v":640},640,{"$f":"C18*SQRT(360)/(D18-1)","v":{"v":216.84189669726032,"d":"216.8"}},{"$f":"C18","v":80},{"$f":"D18","v":8},0,0,640,{"v":8.1316069306303085E-4,"d":"0%"},{"v":51199.99999999999,"d":"51,200"}]
["cropped_I","IPE 100_cropped",100,4.1,55,5.7,409.99999999999994,{"$f":"C19*SQRT(360)/D19","v":{"v":462.7723405124458,"d":"462.8"}},81.6,4.1,55,5.7,{"v":648.06,"d":"648"},{"v":0.01259374999999996,"d":"1%"},{"v":65994.81599999998,"d":"65,995"}]
["half_I","IPE 140 A_half",138,3.8,73,5.6,524.4,{"$f":"C20*SQRT(360)/D20","v":{"v":689.0436585840574,"d":"689.0"}},63.4,3.8,73,5.6,{"v":649.7199999999999,"d":"650"},{"v":2.5614912199487527E-3,"d":"0%"},{"v":46621.40133333333,"d":"46,621"}]
["built_t",{"$f":"CONCATENATE(\"T \",C21,\" x \",D21, \", \",E21,\" x \",F21)","v":"T 80 x 5, 50 x 5"},80,5,{"$f":"C21/2+10","v":50},{"$f":"D21","v":5},400,{"$f":"C21*SQRT(360)/(D21-1)","v":{"v":379.47331922020555,"d":"379.5"}},{"$f":"C21","v":80},{"$f":"D21","v":5},{"$f":"E21","v":50},{"$f":"F21","v":5},{"$f":"I21*J21+K21*L21","v":650},{"v":4.3095487286848311E-4,"d":"0%"},{"$f":"1/6*I21*(4*K21*L21+J21*I21+40*I21)","v":{"v":61333.33333333333,"d":"61,333"}}]
["HP","HP 80*7.0",80,7,21,null,560,{"$f":"C22*SQRT(360)/D22","v":{"v":216.84189669726032,"d":"216.8"}},69.64,7,21,10.36,{"v":705.04,"d":"705"},{"v":0.0846769230769231,"d":"8%"},{"$f":"1/6*I22*(4*K22*L22+J22*I22+40*I22)","v":{"v":48090.134133333326,"d":"48,090"}}]
["cropped_I","IPE 120 A_cropped",118,3.8,64,5.1,448.4,{"$f":"C23*SQRT(360)/D23","v":{"v":589.1822587892665,"d":"589.2"}},100.80000000000001,3.8,64,5.1,{"v":709.44,"d":"709"},{"v":0.006240780664926948,"d":"1%"},{"v":96106.75200000001,"d":"96,107"}]
["flat","F 80 x 8",80,9,{"v":189.73665961010278,"d":"190"},{"$f":"C24*D24","v":720},720,{"$f":"C24*SQRT(360)/(D24-1)","v":{"v":189.73665961010278,"d":"189.7"}},{"$f":"C24","v":80},{"$f":"D24","v":9},0,0,720,{"v":0.014884979702300294,"d":"1%"},{"v":52266.666666666664,"d":"52,267"}]
["half_I","IPE 160 A_half",157,4,82,5.9,628,{"$f":"C25*SQRT(360)/D25","v":{"v":744.7163889696534,"d":"744.7"}},72.6,4,82,5.9,{"v":774.2,"d":"774"},{"v":0.07527777777777778,"d":"8%"},{"v":62068.159999999996,"d":"62,068"}]
["HP","HP 100*6.0",100,6,21.5,null,600,{"$f":"C26*SQRT(360)/D26","v":{"v":316.22776601683796,"d":"316.2"}},88.53,6,21.5,11.47,{"v":777.7850000000001,"d":"778"},{"v":0.004630586411779936,"d":"0%"},{"v":74642.594,"d":"74,643"}]
["built_t",{"$f":"CONCATENATE(\"T \",C27,\" x \",D27, \", \",E27,\" x \",F27)","v":"T 80 x 6, 50 x 6"},80,6,{"$f":"C27/2+10","v":50},{"$f":"D27","v":6},480,{"$f":"C27*SQRT(360)/(D27-1)","v":{"v":303.5786553761644,"d":"303.6"}},{"$f":"C27","v":80},{"$f":"D27","v":6},{"$f":"E27","v":50},{"$f":"F27","v":6},{"$f":"I27*J27+K27*L27","v":780},{"v":2.8478306987147484E-3,"d":"0%"},{"v":65066.666666666664,"d":"65,067"}]
["flat","F 80 x 9",100,8,{"v":271.05237087157536,"d":"271"},{"$f":"C28*D28","v":800},800,{"$f":"C28*SQRT(360)/(D28-1)","v":{"v":271.05237087157536,"d":"271.1"}},{"$f":"C28","v":100},{"$f":"D28","v":8},0,0,800,{"v":0.02564102564102555,"d":"3%"},{"v":79999.99999999999,"d":"80,000"}]
["flat","F 100 x 7",80,10,{"v":168.65480854231356,"d":"169"},{"$f":"C29*D29","v":800},800,{"$f":"C29*SQRT(360)/(D29-1)","v":{"v":168.6548085423136,"d":"168.7"}},{"$f":"C29","v":80},{"$f":"D29","v":10},0,0,800,{"v":0,"d":"0%"},{"v":53333.33333333333,"d":"53,333"}]
["half_I","IPE 140_half",140,4.7,73,6.9,658,{"$f":"C30*SQRT(360)/D30","v":{"v":565.173028625838,"d":"565.2"}},63.1,4.7,73,6.9,{"v":800.27,"d":"800"},{"v":3.3749999999987956E-4,"d":"0%"},{"v":50851.974500000004,"d":"50,852"}]
["cropped_I","IPE 120_cropped",120,4.4,64,6.3,528,{"$f":"C31*SQRT(360)/D31","v":{"v":517.463617118462,"d":"517.5"}},100.4,4.4,64,6.3,{"v":844.96,"d":"845"},{"v":0.055843652767191054,"d":"6%"},{"v":101580.704,"d":"101,581"}]
["cropped_I","IPE 140 A_cropped",138,3.8,73,5.6,524.4,{"$f":"C32*SQRT(360)/D32","v":{"v":689.0436585840574,"d":"689.0"}},119.80000000000001,3.8,73,5.6,{"v":864.04,"d":"864"},{"v":0.022580950577542058,"d":"2%"},{"v":137419.38533333334,"d":"137,419"}]
["HP","HP 100*7.0",100,7,22.5,null,700,{"$f":"C33*SQRT(360)/D33","v":{"v":271.05237087157536,"d":"271.1"}},88.53,7,22.5,11.47,{"v":877.7850000000001,"d":"878"},{"v":0.015907828341280572,"d":"2%"},{"v":76625.81354999999,"d":"76,626"}]
["half_I","IPE 140 R_half",142,5.3,72,7.8,752.6,{"$f":"C34*SQRT(360)/D34","v":{"v":508.3510502761244,"d":"508.4"}},63.2,5.3,72,7.8,{"v":896.56,"d":"897"},{"v":0.02138906452035516,"d":"2%"},{"v":53818.592000000004,"d":"53,819"}]
["flat","F 100 x 8",100,9,{"v":237.17082451262846,"d":"237"},{"$f":"C35*D35","v":900},900,{"$f":"C35*SQRT(360)/(D35-1)","v":{"v":237.17082451262846,"d":"237.2"}},{"$f":"C35","v":100},{"$f":"D35","v":9},0,0,900,{"v":3.8368876594985224E-3,"d":"0%"},{"v":81666.66666666666,"d":"81,667"}]
["built_t",{"$f":"CONCATENATE(\"T \",C36,\" x \",D36, \", \",E36,\" x \",F36)","v":"T 80 x 7, 50 x 7"},80,7,{"$f":"C36/2+10","v":50},{"$f":"D36","v":7},560,{"$f":"C36*SQRT(360)/(D36-1)","v":{"v":252.98221281347037,"d":"253.0"}},{"$f":"C36","v":80},{"$f":"D36","v":7},{"$f":"E36","v":50},{"$f":"F36","v":7},{"$f":"I36*J36+K36*L36","v":910},{"v":0.011111111111111072,"d":"1%"},{"v":68800,"d":"68,800"}]
["HP","HP 120*6.0",120,6,23,null,720,{"$f":"C37*SQRT(360)/D37","v":{"v":379.4733192202055,"d":"379.5"}},107.42,6,23,12.58,{"v":933.8599999999999,"d":"934"},{"v":0.02621978021978011,"d":"3%"},{"v":109186.70093333333,"d":"109,187"}]
["half_I","IPE 180 A_half",177,4.3,91,6.5,761.1,{"$f":"C38*SQRT(360)/D38","v":{"v":781.0090407206555,"d":"781.0"}},82,4.3,91,6.5,{"v":944.0999999999999,"d":"944"},{"v":0.010965241042554474,"d":"1%"},{"v":81980.86666666667,"d":"81,981"}]
["L","L  65*9.0*50*9.0",65,9,50,9,585,{"$f":"C39*SQRT(360)/D39","v":{"v":137.03203194062976,"d":"137.0"}},56,9,50,9,954,{"v":0.01048617731172552,"d":"1%"},{"v":42410.666666666664,"d":"42,411"}]
["built_t",{"$f":"CONCATENATE(\"T \",C40,\" x \",D40, \", \",E40,\" x \",F40)","v":"T 100 x 6, 60 x 6"},100,6,{"$f":"C40/2+10","v":60},{"$f":"D40","v":6},600,{"$f":"C40*SQRT(360)/(D40-1)","v":{"v":379.47331922020555,"d":"379.5"}},{"$f":"C40","v":100},{"$f":"D40","v":6},{"$f":"E40","v":60},{"$f":"F40","v":6},{"$f":"I40*J40+K40*L40","v":960},{"v":6.2893081761006275E-3,"d":"1%"},{"v":100666.66666666666,"d":"100,667"}]
["half_I","IPE 160_half",160,5,82,7.4,800,{"$f":"C41*SQRT(360)/D41","v":{"v":607.1573107523288,"d":"607.2"}},72.6,5,82,7.4,{"v":969.8000000000001,"d":"970"},{"v":0.010208333333333375,"d":"1%"},{"v":68899.81999999999,"d":"68,900"}]
["HP","HP 100*8.0",100,8,23.5,null,800,{"$f":"C42*SQRT(360)/D42","v":{"v":237.17082451262846,"d":"237.2"}},88.53,8,23.5,11.47,{"v":977.7850000000001,"d":"978"},{"v":0.008233656424004865,"d":"1%"},{"v":78609.03309999999,"d":"78,609"}]
["flat","F 100 x 9",100,10,{"v":210.81851067789196,"d":"211"},{"$f":"C43*D43","v":1000},1000,{"$f":"C43*SQRT(360)/(D43-1)","v":{"v":210.81851067789196,"d":"210.8"}},{"$f":"C43","v":100},{"$f":"D43","v":10},0,0,1000,{"v":0.022719718547533407,"d":"2%"},{"v":83333.33333333333,"d":"83,333"}]
["cropped_I","IPE 160 A_cropped",157,4,82,5.9,628,{"$f":"C44*SQRT(360)/D44","v":{"v":744.7163889696534,"d":"744.7"}},138.2,4,82,5.9,{"v":1036.6,"d":"1037"},{"v":0.036599999999999966,"d":"4%"},{"v":184635.19999999998,"d":"184,635"}]
["built_t",{"$f":"CONCATENATE(\"T \",C45,\" x \",D45, \", \",E45,\" x \",F45)","v":"T 80 x 8, 50 x 8"},80,8,{"$f":"C45/2+10","v":50},{"$f":"D45","v":8},640,{"$f":"C45*SQRT(360)/(D45-1)","v":{"v":216.84189669726032,"d":"216.8"}},{"$f":"C45","v":80},{"$f":"D45","v":8},{"$f":"E45","v":50},{"$f":"F45","v":8},{"$f":"I45*J45+K45*L45","v":1040},{"v":0.003279953694771409,"d":"0%"},{"v":72533.33333333333,"d":"72,533"}]
["L","L  75*9.0*50*9.0",75,9,50,9,675,{"$f":"C46*SQRT(360)/D46","v":{"v":158.11388300841898,"d":"158.1"}},66,9,50,9,1044,{"v":3.8461538461538325E-3,"d":"0%"},{"v":55374,"d":"55,374"}]
["HP","HP 120*7.0",120,7,24,null,840,{"v":325.26284504589046,"d":"325.3"},107.42,7,24,12.58,{"v":1053.8600000000001,"d":"1054"},{"v":0.009444444444444589,"d":"1%"},{"v":112010.77273333333,"d":"112,011"}]
["cropped_I","IPE 140_cropped",140,4.7,73,6.9,658,{"v":565.173028625838,"d":"565.2"},119.19999999999999,4.7,73,6.9,{"v":1063.94,"d":"1064"},{"v":0.009564837834247442,"d":"1%"},{"v":145881.72799999997,"d":"145,882"}]
["L","L  75*9.0*55*9.0",75,9,55,9,675,{"v":158.11388300841898,"d":"158.1"},66,9,55,9,1089,{"v":0.023553959809763603,"d":"2%"},{"v":57354,"d":"57,354"}]
["half_I","IPE 160 R_half",162,5.6,81,8.5,907.1999999999999,{"v":548.8810510149401,"d":"548.9"},72.5,5.6,81,8.5,{"v":1094.5,"d":"1095"},{"v":5.050505050504972E-3,"d":"1%"},{"v":73225,"d":"73,225"}]
["L","L 100 x 65 x 7",100,7,65,7,700,{"v":271.05237087157536,"d":"271.1"},93,7,65,7,1106,{"v":0.010507080858839668,"d":"1%"},{"v":95960.5,"d":"95,961"}]
["HP","HP 140*6.0",140,6,25,null,840,{"v":442.71887242357315,"d":"442.7"},125.94,6,25,14.06,{"v":1107.1399999999999,"d":"1107"},{"v":1.0307414104882007E-3,"d":"0%"},{"v":151112.0476,"d":"151,112"}]
["built_t",{"$f":"CONCATENATE(\"T \",C53,\" x \",D53, \", \",E53,\" x \",F53)","v":"T 100 x 7, 60 x 7"},100,7,{"$f":"C53/2+10","v":60},{"$f":"D53","v":7},700,{"$f":"C53*SQRT(360)/(D53-1)","v":{"v":316.22776601683796,"d":"316.2"}},{"$f":"C53","v":100},7,60,7,{"$f":"I53*J53+K53*L53","v":1120},{"v":0.011615513846487513,"d":"1%"},{"v":106333.33333333331,"d":"106,333"}]
["built_t",{"$f":"CONCATENATE(\"T \",C54,\" x \",D54, \", \",E54,\" x \",F54)","v":"T 120 x 6, 70 x 6"},120,6,{"$f":"C54/2+10","v":70},{"$f":"D54","v":6},720,{"$f":"C54*SQRT(360)/(D54-1)","v":{"v":455.36798306424663,"d":"455.4"}},120,6,70,6,{"$f":"I54*J54+K54*L54","v":1140},{"v":0.017857142857142794,"d":"2%"},{"v":144000,"d":"144,000"}]
["half_I","IPE 180_half",180,5.3,91,8,954,{"$f":"C55*SQRT(360)/D55","v":{"v":644.3886552795943,"d":"644.4"}},82,5.3,91,8,{"v":1162.6,"d":"1163"},{"v":0.019824561403508634,"d":"2%"},{"v":90563.53333333334,"d":"90,564"}]
["built_t",{"$f":"CONCATENATE(\"T \",C56,\" x \",D56, \", \",E56,\" x \",F56)","v":"T 80 x 9, 50 x 9"},80,9,{"$f":"C56/2+10","v":50},{"$f":"D56","v":9},720,{"$f":"C56*SQRT(360)/(D56-1)","v":{"v":189.73665961010278,"d":"189.7"}},{"$f":"C56","v":80},{"$f":"D56","v":9},{"$f":"E56","v":50},{"$f":"F56","v":9},{"$f":"I56*J56+K56*L56","v":1170},{"v":6.3650438671942755E-3,"d":"1%"},{"v":76266.66666666666,"d":"76,267"}]
["HP","HP 120*8.0",120,8,25,null,960,{"$f":"C57*SQRT(360)/D57","v":{"v":284.60498941515414,"d":"284.6"}},107.42,8,25,12.58,{"v":1173.8600000000001,"d":"1174"},{"v":3.299145299145323E-3,"d":"0%"},{"v":114834.84453333332,"d":"114,835"}]
["cropped_I","IPE 140 R_cropped",142,5.3,72,7.8,752.6,{"$f":"C58*SQRT(360)/D58","v":{"v":508.3510502761244,"d":"508.4"}},117.39999999999999,5.3,72,7.8,{"v":1183.82,"d":"1184"},{"v":0.008484827832961228,"d":"1%"},{"v":148014.39799999996,"d":"148,014"}]
["flat","F 120 x 9",120,10,{"v":252.98221281347037,"d":"253"},{"$f":"C59*D59","v":1200},1200,{"$f":"C59*SQRT(360)/(D59-1)","v":{"v":252.98221281347034,"d":"253.0"}},{"$f":"C59","v":120},{"$f":"D59","v":10},0,0,1200,{"v":0.013667618387930736,"d":"1%"},{"v":120000,"d":"120,000"}]
["HP","HP 140*7.0",140,7,26,null,980,{"$f":"C60*SQRT(360)/D60","v":{"v":379.47331922020555,"d":"379.5"}},125.94,7,26,14.06,{"v":1247.1399999999999,"d":"1247"},{"v":0.03928333333333334,"d":"4%"},{"v":154936.00579999998,"d":"154,936"}]
["L","L 100 x 65 x 8",100,8,65,8,800,{"$f":"C61*SQRT(360)/D61","v":{"v":237.17082451262846,"d":"237.2"}},92,8,65,8,1256,{"v":0.007104254534374688,"d":"1%"},{"v":99605.33333333333,"d":"99,605"}]
["cropped_I","IPE 180 A_cropped",177,4.3,91,6.5,761.1,{"$f":"C62*SQRT(360)/D62","v":{"v":781.0090407206555,"d":"781.0"}},155,4.3,91,6.5,1258,{"v":1.5923566878981443E-3,"d":"0%"},{"v":238506.25,"d":"238,506"}]
["built_t",{"$f":"CONCATENATE(\"T \",C63,\" x \",D63, \", \",E63,\" x \",F63)","v":"T 100 x 8, 60 x 8"},100,8,{"$f":"C63/2+10","v":60},{"$f":"D63","v":8},800,{"$f":"C63*SQRT(360)/(D63-1)","v":{"v":271.05237087157536,"d":"271.1"}},{"$f":"C63","v":100},{"$f":"D63","v":8},{"$f":"E63","v":60},{"$f":"F63","v":8},{"$f":"I63*J63+K63*L63","v":1280},{"v":0.01748807631160565,"d":"2%"},{"v":111999.99999999999,"d":"112,000"}]
["cropped_I","IPE 160_cropped",160,5,82,7.4,800,{"$f":"C64*SQRT(360)/D64","v":{"v":607.1573107523288,"d":"607.2"}},136.2,5,82,7.4,{"v":1287.8000000000002,"d":"1288"},{"v":0.006093750000000231,"d":"1%"},{"v":194225.74,"d":"194,226"}]
["built_t",{"$f":"CONCATENATE(\"T \",C65,\" x \",D65, \", \",E65,\" x \",F65)","v":"T 80 x 10, 50 x 10"},80,10,{"$f":"C65/2+10","v":50},{"$f":"D65","v":10},800,{"$f":"C65*SQRT(360)/(D65-1)","v":{"v":168.6548085423136,"d":"168.7"}},{"$f":"C65","v":80},10,50,10,{"$f":"I65*J65+K65*L65","v":1300},{"v":0.00947352073303298,"d":"1%"},{"v":80000,"d":"80,000"}]
["built_t",{"$f":"CONCATENATE(\"T \",C66,\" x \",D66, \", \",E66,\" x \",F66)","v":"T 140 x 6, 80 x 6"},140,6,{"$f":"C66/2+10","v":80},{"$f":"D66","v":6},840,{"$f":"C66*SQRT(360)/(D66-1)","v":{"v":531.2626469082877,"d":"531.3"}},140,6,80,6,{"$f":"I66*J66+K66*L66","v":1320},{"v":0.01538461538461533,"d":"2%"},{"v":195066.66666666666,"d":"195,067"}]
["flat","F 120 x 10",120,11,{"v":227.68399153212331,"d":"228"},{"$f":"C67*D67","v":1320},1320,{"$f":"C67*SQRT(360)/(D67-1)","v":{"v":227.68399153212331,"d":"227.7"}},{"$f":"C67","v":120},{"$f":"D67","v":11},0,0,1320,{"v":0,"d":"0%"},{"v":122400,"d":"122,400"}]
["half_I","IPE 180 O_half",182,6,92,9,1092,{"$f":"C68*SQRT(360)/D68","v":{"v":575.5345341506451,"d":"575.5"}},82,6,92,9,1320,{"$f":"M68/M67-1","v":{"v":0,"d":"0%"}},{"v":96814.66666666666,"d":"96,815"}]
["built_t",{"$f":"CONCATENATE(\"T \",C69,\" x \",D69, \", \",E69,\" x \",F69)","v":"T 120 x 7, 70 x 7"},120,7,{"$f":"C69/2+10","v":70},{"$f":"D69","v":7},{"$f":"C69*D69","v":840},{"$f":"C69*SQRT(360)/(D69-1)","v":{"v":379.4733192202055,"d":"379.5"}},{"$f":"C69","v":120},{"$f":"D69","v":7},{"$f":"E69","v":70},{"$f":"F69","v":7},{"$f":"I69*J69+K69*L69","v":1330},{"v":7.575757575757569E-3,"d":"1%"},{"v":152000,"d":"152,000"}]
["L","L 100 x 75 x 8",100,8,75,8,800,{"$f":"C70*SQRT(360)/D70","v":{"v":237.17082451262846,"d":"237.2"}},92,8,75,8,1336,{"v":0.004511278195488799,"d":"0%"},{"v":104511.99999999999,"d":"104,512"}]
["L","L  80*10.0*65*10.0",80,10,65,10,800,{"v":151.7893276880822,"d":"151.8"},70,10,65,10,1350,{"v":0.010479041916167775,"d":"1%"},{"v":71166.66666666666,"d":"71,167"}]
["half_I","IPE 200_half",200,5.6,100,8.5,1120,{"v":677.6309271789385,"d":"677.6"},91.5,5.6,100,8.5,{"v":1362.4,"d":"1362"},{"v":0.009185185185185185,"d":"1%"},{"v":115479.09999999999,"d":"115,479"}]
["half_I","IPE 180 R_half",183,6.4,89,9.5,1171.2,{"v":542.5282610726375,"d":"542.5"},82,6.4,89,9.5,{"v":1370.3000000000002,"d":"1370"},{"v":0.005798590722254859,"d":"1%"},{"v":98219.59999999999,"d":"98,220"}]
["HP","HP 140*8.0",140,8,27,null,1120,{"v":332.03915431767985,"d":"332.0"},125.94,8,27,14.06,{"v":1387.1399999999999,"d":"1387"},{"v":0.01228927971976912,"d":"1%"},{"v":158759.964,"d":"158,760"}]
["L","L  100*10.0*50*10.0",100,10,50,10,1000,{"v":189.73665961010278,"d":"189.7"},90,10,50,10,1400,{"v":0.009270873884395403,"d":"1%"},{"v":97500,"d":"97,500"}]
["L","L  100*9.0*65*9.0",100,9,65,9,900,{"v":210.81851067789196,"d":"210.8"},91,9,65,9,1404,{"v":2.8571428571428914E-3,"d":"0%"},{"v":103118.16666666666,"d":"103,118"}]
["flat","F 120 x 11",120,12,{"v":206.98544684738482,"d":"207"},{"$f":"C77*D77","v":1440},1440,{"$f":"C77*SQRT(360)/(D77-1)","v":{"v":206.98544684738482,"d":"207.0"}},{"$f":"C77","v":120},{"$f":"D77","v":12},0,0,1440,{"v":0.02564102564102555,"d":"3%"},{"v":124800,"d":"124,800"}]
["cropped_I","IPE 160 R_cropped",162,5.6,81,8.5,907.1999999999999,{"$f":"C78*SQRT(360)/D78","v":{"v":548.8810510149401,"d":"548.9"}},136,5.6,81,8.5,{"v":1450.1,"d":"1450"},{"v":0.007013888888888875,"d":"1%"},{"v":202993.59999999998,"d":"202,994"}]
["HP","HP 160*7.0",160,7,29,null,1120,{"$f":"C79*SQRT(360)/D79","v":{"v":433.68379339452065,"d":"433.7"}},143.72,7,29,16.28,{"v":1478.1599999999999,"d":"1478"},{"v":0.01935038962830138,"d":"2%"},{"v":207036.32506666667,"d":"207,036"}]
["L","L  100*9.0*75*9.0",100,9,75,9,900,{"$f":"C80*SQRT(360)/D80","v":{"v":210.81851067789196,"d":"210.8"}},91,9,75,9,1494,{"v":0.010716025328787238,"d":"1%"},{"v":108578.16666666666,"d":"108,578"}]
["built_t",{"$f":"CONCATENATE(\"T \",C81,\" x \",D81, \", \",E81,\" x \",F81)","v":"T 160 x 6, 90 x 6"},160,6,{"$f":"C81/2+10","v":90},{"$f":"D81","v":6},960,{"$f":"C81*SQRT(360)/(D81-1)","v":{"v":607.1573107523288,"d":"607.2"}},{"$f":"C81","v":160},6,90,6,{"$f":"I81*J81+K81*L81","v":1500},{"v":0.004016064257028162,"d":"0%"},{"v":253866.66666666666,"d":"253,867"}]
["built_t",{"$f":"CONCATENATE(\"T \",C82,\" x \",D82, \", \",E82,\" x \",F82)","v":"T 120 x 8, 70 x 8"},120,8,{"$f":"C82/2+10","v":70},{"$f":"D82","v":8},960,{"$f":"C82*SQRT(360)/(D82-1)","v":{"v":325.26284504589046,"d":"325.3"}},120,8,70,8,{"$f":"I82*J82+K82*L82","v":1520},{"v":0.01333333333333342,"d":"1%"},{"v":160000,"d":"160,000"}]
["HP","HP 140*9.0",140,9,28,null,1260,{"$f":"C83*SQRT(360)/D83","v":{"v":295.14591494904874,"d":"295.1"}},125.94,9,28,14.06,{"v":1527.14,"d":"1527"},{"v":0.004697368421052728,"d":"0%"},{"v":162583.9222,"d":"162,584"}]
["L","L 120 x 80 x 8",120,8,80,8,960,{"$f":"C84*SQRT(360)/D84","v":{"v":284.60498941515414,"d":"284.6"}},112,8,80,8,1536,{"v":0.005801694671084379,"d":"1%"},{"v":148138.66666666666,"d":"148,139"}]
["L","L 125 x 75 x 8",125,8,75,8,1000,{"$f":"C85*SQRT(360)/D85","v":{"v":296.46353064078556,"d":"296.5"}},117,8,75,8,1536,{"v":0,"d":"0%"},{"v":156312,"d":"156,312"}]
["half_I","IPE 200 O_half",202,6.2,102,9.5,1252.4,{"$f":"C86*SQRT(360)/D86","v":{"v":618.1742780845284,"d":"618.2"}},91.5,6.2,102,9.5,{"v":1536.3000000000002,"d":"1536"},{"v":1.9531250000004441E-4,"d":"0%"},{"$f":"1/6*I86*(4*K86*L86+J86*I86+40*I86)","v":{"v":123575.325,"d":"123,575"}}]
["built_t",{"$f":"CONCATENATE(\"T \",C87,\" x \",D87, \", \",E87,\" x \",F87)","v":"T 140 x 7, 80 x 7"},140,7,{"$f":"C87/2+10","v":80},{"$f":"D87","v":7},980,{"$f":"C87*SQRT(360)/(D87-1)","v":{"v":442.71887242357315,"d":"442.7"}},{"$f":"C87","v":140},{"$f":"D87","v":7},{"$f":"E87","v":80},{"$f":"F87","v":7},{"$f":"I87*J87+K87*L87","v":1540},{"v":2.4083837792097107E-3,"d":"0%"},{"v":205800,"d":"205,800"}]
["flat","F 140 x 10",140,11,{"v":265.63132345414385,"d":"266"},{"$f":"C88*D88","v":1540},1540,{"$f":"C88*SQRT(360)/(D88-1)","v":{"v":265.63132345414385,"d":"265.6"}},{"$f":"C88","v":140},{"$f":"D88","v":11},0,0,1540,{"v":0,"d":"0%"},{"v":166600,"d":"166,600"}]
["cropped_I","IPE 180_cropped",180,5.3,91,8,954,{"$f":"C89*SQRT(360)/D89","v":{"v":644.3886552795943,"d":"644.4"}},155,5.3,91,8,{"v":1549.5,"d":"1550"},{"v":6.168831168831268E-3,"d":"1%"},{"v":256615.41666666666,"d":"256,615"}]
["half_I","IPE 220_half",220,5.9,110,9.2,1298,{"$f":"C90*SQRT(360)/D90","v":{"v":707.4926290546204,"d":"707.5"}},100.8,5.9,110,9.2,{"v":1606.7199999999998,"d":"1607"},{"v":0.03692804130364613,"d":"4%"},{"v":145735.29599999997,"d":"145,735"}]
["half_I","IPE 200 R_half",204,6.6,98,10.5,1346.3999999999999,{"$f":"C91*SQRT(360)/D91","v":{"v":586.4587660675904,"d":"586.5"}},91.5,6.6,98,10.5,{"v":1632.9,"d":"1633"},{"v":0.016294064927305563,"d":"2%"},{"v":127793.47499999999,"d":"127,793"}]
["HP","HP 160*8.0",160,8,30,null,1280,{"$f":"C92*SQRT(360)/D92","v":{"v":379.47331922020555,"d":"379.5"}},143.72,8,30,16.28,{"v":1638.16,"d":"1638"},{"v":0.003221262784003809,"d":"0%"},{"v":212038.73919999998,"d":"212,039"}]
["L","L 100 x 75 x 10",100,10,75,10,1000,{"$f":"C93*SQRT(360)/D93","v":{"v":189.73665961010278,"d":"189.7"}},90,10,75,10,1650,{"v":0.007227621233579118,"d":"1%"},{"v":112500,"d":"112,500"}]
["flat","F 140 x 11",140,12,{"v":241.48302132194897,"d":"241"},{"$f":"C94*D94","v":1680},1680,{"$f":"C94*SQRT(360)/(D94-1)","v":{"v":241.48302132194897,"d":"241.5"}},{"$f":"C94","v":140},{"$f":"D94","v":12},0,0,1680,{"v":0.018181818181818077,"d":"2%"},{"v":169866.66666666666,"d":"169,867"}]
["L","L  100*11.0*65*11.0",100,11,65,11,1100,{"$f":"C95*SQRT(360)/D95","v":{"v":172.4878723728207,"d":"172.5"}},89,11,65,11,1694,{"v":0.008333333333333304,"d":"1%"},{"v":109751.83333333333,"d":"109,752"}]
["built_t",{"$f":"CONCATENATE(\"T \",C96,\" x \",D96, \", \",E96,\" x \",F96)","v":"T 160 x 7, 90 x 7"},160,7,{"$f":"C96/2+10","v":90},{"$f":"D96","v":7},1120,{"$f":"C96*SQRT(360)/(D96-1)","v":{"v":505.96442562694074,"d":"506.0"}},{"$f":"C96","v":160},{"$f":"D96","v":7},{"$f":"E96","v":90},{"$f":"F96","v":7},{"$f":"I96*J96+K96*L96","v":1750},{"v":0.03305785123966931,"d":"3%"},{"v":267733.3333333333,"d":"267,733"}]
["cropped_I","IPE 180 O_cropped",182,6,92,9,1092,{"$f":"C97*SQRT(360)/D97","v":{"v":575.5345341506451,"d":"575.5"}},155,6,92,9,1758,{"v":0.004571428571428671,"d":"0%"},{"v":269751.6666666666,"d":"269,752"}]
["built_t",{"$f":"CONCATENATE(\"T \",C98,\" x \",D98, \", \",E98,\" x \",F98)","v":"T 140 x 8, 80 x 8"},140,8,{"$f":"C98/2+10","v":80},{"$f":"D98","v":8},1120,{"$f":"C98*SQRT(360)/(D98-1)","v":{"v":379.47331922020555,"d":"379.5"}},{"$f":"C98","v":140},{"$f":"D98","v":8},{"$f":"E98","v":80},{"$f":"F98","v":8},{"$f":"I98*J98+K98*L98","v":1760},{"v":1.1376564277587597E-3,"d":"0%"},{"v":216533.3333333333,"d":"216,533"}]
["HP","HP 160*9.0",160,9,31,null,1440,{"$f":"C99*SQRT(360)/D99","v":{"v":337.3096170846272,"d":"337.3"}},143.72,9,31,16.28,{"v":1798.16,"d":"1798"},{"v":0.021681818181818135,"d":"2%"},{"v":217041.15333333332,"d":"217,041"}]
["L","L  100*11.0*75*11.0",100,11,75,11,1100,{"$f":"C100*SQRT(360)/D100","v":{"v":172.4878723728207,"d":"172.5"}},89,11,75,11,1804,{"v":3.247764381367535E-3,"d":"0%"},{"v":116278.49999999999,"d":"116,279"}]
["cropped_I","IPE 200_cropped",200,5.6,100,8.5,1120,{"$f":"C101*SQRT(360)/D101","v":{"v":677.6309271789385,"d":"677.6"}},171,5.6,100,8.5,{"v":1807.6,"d":"1808"},{"v":0.001995565410199518,"d":"0%"},{"v":319131.60000000003,"d":"319,132"}]
["half_I","IPE 220 O_half",222,6.6,112,10.2,1465.1999999999998,{"$f":"C102*SQRT(360)/D102","v":{"v":638.2051277794366,"d":"638.2"}},100.8,6.6,112,10.2,{"v":1807.6799999999998,"d":"1808"},{"v":4.4257579110418277E-5,"d":"0%"},{"v":155683.58399999997,"d":"155,684"}]
["cropped_I","IPE 180 R_cropped",183,6.4,89,9.5,1171.2,{"$f":"C103*SQRT(360)/D103","v":{"v":542.5282610726375,"d":"542.5"}},152,6.4,89,9.5,{"v":1818.3000000000002,"d":"1818"},{"v":0.005874933616569544,"d":"1%"},{"v":264348.26666666666,"d":"264,348"}]
["flat","F 140 x 12",140,13,{"v":221.35943621178654,"d":"221"},{"$f":"C104*D104","v":1820},1820,{"$f":"C104*SQRT(360)/(D104-1)","v":{"v":221.35943621178657,"d":"221.4"}},{"$f":"C104","v":140},{"$f":"D104","v":13},0,0,1820,{"v":9.3493922894993808E-4,"d":"0%"},{"v":173133.3333333333,"d":"173,133"}]
["L","L  130*10.0*65*10.0",130,10,65,10,1300,{"$f":"C105*SQRT(360)/D105","v":{"v":246.6576574931336,"d":"246.7"}},120,10,65,10,1850,{"v":0.016483516483516425,"d":"2%"},{"v":172000,"d":"172,000"}]
["half_I","IPE 240_half",240,6.2,120,9.8,1488,{"$f":"C106*SQRT(360)/D106","v":{"v":734.4644888133009,"d":"734.5"}},110.2,6.2,120,9.8,{"v":1859.24,"d":"1859"},{"v":0.004994594594594615,"d":"0%"},{"v":179905.908,"d":"179,906"}]
["L","L  120*10.0*80*10.0",120,10,80,10,1200,{"$f":"C107*SQRT(360)/D107","v":{"v":227.68399153212331,"d":"227.7"}},110,10,80,10,1900,{"v":0.02192293625352293,"d":"2%"},{"v":159500,"d":"159,500"}]
["L","L 125 x 75 x 10",125,10,75,10,1250,{"$f":"C108*SQRT(360)/D108","v":{"v":237.17082451262846,"d":"237.2"}},115,10,75,10,1900,{"v":0,"d":"0%"},{"v":167708.3333333333,"d":"167,708"}]
["HP","HP 180*8.0",180,8,33,null,1440,{"$f":"C109*SQRT(360)/D109","v":{"v":426.9074841227312,"d":"426.9"}},161.5,8,33,18.5,{"v":1902.5,"d":"1903"},{"v":0.001315789473684159,"d":"0%"},{"v":274388.5,"d":"274,389"}]
["flat","F 140 x 13",160,12,{"v":275.9805957965131,"d":"276"},{"$f":"C110*D110","v":1920},1920,{"$f":"C110*SQRT(360)/(D110-1)","v":{"v":275.9805957965131,"d":"276.0"}},{"$f":"C110","v":160},{"$f":"D110","v":12},0,0,1920,{"v":0.009198423127463773,"d":"1%"},{"v":221866.66666666666,"d":"221,867"}]
["L","L  150*9.0*75*9.0",150,9,75,9,1350,{"$f":"C111*SQRT(360)/D111","v":{"v":316.22776601683796,"d":"316.2"}},141,9,75,9,1944,{"v":0.012499999999999956,"d":"1%"},{"v":225811.5,"d":"225,812"}]
["half_I","IPE 220 R_half",225,6.7,108,11.8,1507.5,{"$f":"C112*SQRT(360)/D112","v":{"v":637.1753494369123,"d":"637.2"}},100.7,6.7,108,11.8,{"v":1949.0900000000001,"d":"1949"},{"v":2.6183127572017018E-3,"d":"0%"},{"v":164481.53383333332,"d":"164,482"}]
["L","L  130*10.0*75*10.0",130,10,75,10,1300,{"$f":"C113*SQRT(360)/D113","v":{"v":246.6576574931336,"d":"246.7"}},120,10,75,10,1950,{"v":4.6688454612153762E-4,"d":"0%"},{"v":180000,"d":"180,000"}]
["L","L 100 x 75 x 12",100,12,75,12,1200,{"$f":"C114*SQRT(360)/D114","v":{"v":158.11388300841898,"d":"158.1"}},88,12,75,12,1956,{"v":0.003076923076922977,"d":"0%"},{"v":119914.66666666666,"d":"119,915"}]
["built_t",{"$f":"CONCATENATE(\"T \",C115,\" x \",D115, \", \",E115,\" x \",F115)","v":"T 180 x 7, 100 x 7"},180,7,{"$f":"C115/2+10","v":100},{"$f":"D115","v":7},1260,{"$f":"C115*SQRT(360)/(D115-1)","v":{"v":569.2099788303083,"d":"569.2"}},{"$f":"C115","v":180},{"$f":"D115","v":7},{"$f":"E115","v":100},{"$f":"F115","v":7},{"$f":"I115*J115+K115*L115","v":1960},{"v":2.044989775051187E-3,"d":"0%"},{"v":337800,"d":"337,800"}]
["flat","F 160 x 11",140,14,{"v":204.33178727241838,"d":"204"},{"$f":"C116*D116","v":1960},1960,{"$f":"C116*SQRT(360)/(D116-1)","v":{"v":204.33178727241835,"d":"204.3"}},{"$f":"C116","v":140},14,0,0,1960,{"v":0,"d":"0%"},{"v":176400,"d":"176,400"}]
["built_t",{"$f":"CONCATENATE(\"T \",C117,\" x \",D117, \", \",E117,\" x \",F117)","v":"T 140 x 9, 80 x 9"},140,9,{"$f":"C117/2+10","v":80},{"$f":"D117","v":9},1260,{"$f":"C117*SQRT(360)/(D117-1)","v":{"v":332.03915431767985,"d":"332.0"}},140,9,{"$f":"E117","v":80},{"$f":"F117","v":9},{"$f":"I117*J117+K117*L117","v":1980},{"v":0.010204081632652962,"d":"1%"},{"v":227266.66666666666,"d":"227,267"}]
["built_t",{"$f":"CONCATENATE(\"T \",C118,\" x \",D118, \", \",E118,\" x \",F118)","v":"T 160 x 8, 90 x 8"},160,8,{"$f":"C118/2+10","v":90},{"$f":"D118","v":8},1280,{"$f":"C118*SQRT(360)/(D118-1)","v":{"v":433.68379339452065,"d":"433.7"}},160,8,{"$f":"E118","v":90},{"$f":"F118","v":8},{"$f":"I118*J118+K118*L118","v":2000},{"v":0.010101010101010166,"d":"1%"},{"v":281600,"d":"281,600"}]
["cropped_I","IPE 200 O_cropped",202,6.2,102,9.5,1252.4,{"$f":"C119*SQRT(360)/D119","v":{"v":618.1742780845284,"d":"618.2"}},171,6.2,102,9.5,{"v":2029.2,"d":"2029"},{"v":0.014599999999999946,"d":"1%"},{"v":335621.7,"d":"335,622"}]
["flat","F 160 x 12",160,13,{"v":252.98221281347037,"d":"253"},{"$f":"C120*D120","v":2080},2080,{"$f":"C120*SQRT(360)/(D120-1)","v":{"v":252.98221281347037,"d":"253.0"}},{"$f":"C120","v":160},{"$f":"D120","v":13},0,0,2080,{"v":0.02503449635324273,"d":"3%"},{"v":226133.3333333333,"d":"226,133"}]
["HP","HP 180*9.0",180,9,34,null,1620,{"$f":"C121*SQRT(360)/D121","v":{"v":379.4733192202055,"d":"379.5"}},161.5,9,34,18.5,{"v":2082.5,"d":"2083"},{"v":1.2019230769231282E-3,"d":"0%"},{"v":280727.375,"d":"280,727"}]
["half_I","IPE 240 O_half",242,7,122,10.8,1694,{"v":655.9467375092124,"d":"655.9"},110.2,7,122,10.8,2089,{"v":3.1212484993996537E-3,"d":"0%"},{"v":191927.99333333332,"d":"191,928"}]
["L","L  130*10.0*90*10.0",130,10,90,10,1300,{"v":246.6576574931336,"d":"246.7"},120,10,90,10,2100,{"v":0.005265677357587428,"d":"1%"},{"v":192000,"d":"192,000"}]
["cropped_I","IPE 220_cropped",220,5.9,110,9.2,1298,{"v":707.4926290546204,"d":"707.5"},189.60000000000002,5.9,110,9.2,{"v":2130.64,"d":"2131"},{"v":0.014590476190476043,"d":"1%"},{"v":402920.224,"d":"402,920"}]
["L","L 150 x 75 x 10",150,10,75,10,1500,{"v":284.60498941515414,"d":"284.6"},140,10,75,10,2150,{"v":0.009086471670484153,"d":"1%"},{"v":233333.3333333333,"d":"233,333"}]
["cropped_I","IPE 200 R_cropped",204,6.6,98,10.5,1346.3999999999999,{"v":586.4587660675904,"d":"586.5"},171,6.6,98,10.5,{"v":2157.6,"d":"2158"},{"v":3.5348837209301376E-3,"d":"0%"},{"v":344411.10000000003,"d":"344,411"}]
["built_t",{"$f":"CONCATENATE(\"T \",C127,\" x \",D127, \", \",E127,\" x \",F127)","v":"T 200 x 7, 110 x 7"},200,7,{"$f":"C127/2+10","v":110},{"$f":"D127","v":7},1400,{"$f":"C127*SQRT(360)/(D127-1)","v":{"v":632.4555320336759,"d":"632.5"}},{"$f":"C127","v":200},{"$f":"D127","v":7},{"$f":"E127","v":110},{"$f":"F127","v":7},{"$f":"I127*J127+K127*L127","v":2170},{"v":0.005747126436781658,"d":"1%"},{"v":415999.99999999994,"d":"416,000"}]
["L","L  130*12.0*65*12.0",130,12,65,12,1560,{"$f":"C128*SQRT(360)/D128","v":{"v":205.54804791094466,"d":"205.5"}},118,12,65,12,2196,{"v":0.011981566820276512,"d":"1%"},{"v":182034.66666666666,"d":"182,035"}]
["half_I","IPE 270_half",270,6.6,135,10.2,1782,{"$f":"C129*SQRT(360)/D129","v":{"v":776.1954256776932,"d":"776.2"}},124.8,6.6,135,10.2,{"v":2200.68,"d":"2201"},{"v":2.1311475409835356E-3,"d":"0%"},{"v":235532.54399999997,"d":"235,533"}]
["flat","F 160 x 13",160,14,{"v":233.52204259704956,"d":"234"},{"$f":"C130*D130","v":2240},2240,{"$f":"C130*SQRT(360)/(D130-1)","v":{"v":233.52204259704956,"d":"233.5"}},{"$f":"C130","v":160},{"$f":"D130","v":14},0,0,2240,{"v":0.017867204682189275,"d":"2%"},{"v":230399.99999999997,"d":"230,400"}]
["L","L  120*12.0*80*12.0",120,12,80,12,1440,{"$f":"C131*SQRT(360)/D131","v":{"v":189.73665961010275,"d":"189.7"}},108,12,80,12,2256,{"v":7.1428571428571175E-3,"d":"1%"},{"v":170208,"d":"170,208"}]
["L","L 125 x 75 x 12",125,12,75,12,1500,{"v":197.64235376052372,"d":"197.6"},113,12,75,12,2256,{"$f":"M132/M131-1","v":{"v":0,"d":"0%"}},{"v":178464.66666666666,"d":"178,465"}]
["HP","HP 180*10.0",180,10,35,null,{"$f":"C133*D133","v":1800},{"v":341.525987298185,"d":"341.5"},161.5,10,35,18.5,{"v":2262.5,"d":"2263"},{"v":2.8812056737588243E-3,"d":"0%"},{"v":287066.25,"d":"287,066"}]
["half_I","IPE 240 R_half",245,7.5,118,12.3,1837.5,{"v":619.8064213930024,"d":"619.8"},110.2,7.5,118,12.3,{"v":2277.9,"d":"2278"},{"v":0.006806629834254174,"d":"1%"},{"v":202769.83666666667,"d":"202,770"}]
["L","L  150*10.0*90*10.0",150,10,90,10,1500,{"v":284.60498941515414,"d":"284.6"},140,10,90,10,2300,{"v":0.009701918433644874,"d":"1%"},{"v":247333.3333333333,"d":"247,333"}]
["L","L  160*10.0*80*10.0",160,10,80,10,1600,{"v":303.5786553761644,"d":"303.6"},150,10,80,10,2300,{"v":0,"d":"0%"},{"v":267500,"d":"267,500"}]
["L","L  130*12.0*75*12.0",130,12,75,12,1560,{"v":205.54804791094466,"d":"205.5"},118,12,75,12,2316,{"v":0.006956521739130528,"d":"1%"},{"v":191474.66666666666,"d":"191,475"}]
["L","L  150*11.0*75*11.0",150,11,75,11,1650,{"v":258.73180855923107,"d":"258.7"},139,11,75,11,2354,{"v":0.016407599309153698,"d":"2%"},{"v":240678.49999999997,"d":"240,679"}]
["HP","HP 200*9.0",200,9,37,null,1800,{"v":421.63702135578393,"d":"421.6"},179.28,9,37,20.72,{"v":2380.16,"d":"2380"},{"v":0.011112999150382219,"d":"1%"},{"v":354116.24639999995,"d":"354,116"}]
["cropped_I","IPE 220 O_cropped",222,6.6,112,10.2,1465.1999999999998,{"v":638.2051277794366,"d":"638.2"},189.60000000000002,6.6,112,10.2,{"v":2393.76,"d":"2394"},{"v":5.7139015864480225E-3,"d":"1%"},{"v":423596.736,"d":"423,597"}]
["L","L  150*10.0*100*10.0",150,10,100,10,1500,{"v":284.60498941515414,"d":"284.6"},140,10,100,10,2400,{"v":2.6067776218166028E-3,"d":"0%"},{"v":256666.66666666666,"d":"256,667"}]
["HP","HP 180*11.0",180,11,36,null,1980,{"v":310.47817027107726,"d":"310.5"},161.5,11,36,18.5,{"v":2442.5,"d":"2443"},{"v":0.017708333333333437,"d":"2%"},{"v":293405.125,"d":"293,405"}]
["cropped_I","IPE 240_cropped",240,6.2,120,9.8,1488,{"v":734.4644888133009,"d":"734.5"},205.39999999999998,6.2,120,9.8,{"v":2449.4799999999996,"d":"2449"},{"v":2.8577277379731036E-3,"d":"0%"},{"v":485890.1319999999,"d":"485,890"}]
["built_t",{"$f":"CONCATENATE(\"T \",C144,\" x \",D144, \", \",E144,\" x \",F144)","v":"T 200 x 8, 110 x 8"},200,8,{"$f":"C144/2+10","v":110},{"$f":"D144","v":8},1600,{"$f":"C144*SQRT(360)/(D144-1)","v":{"v":542.1047417431507,"d":"542.1"}},{"$f":"C144","v":200},{"$f":"D144","v":8},{"$f":"E144","v":110},{"$f":"F144","v":8},{"$f":"I144*J144+K144*L144","v":2480},{"v":0.012459787383444887,"d":"1%"},{"v":437333.33333333326,"d":"437,333"}]
["L","L  130*12.0*90*12.0",130,12,90,12,1560,{"$f":"C145*SQRT(360)/D145","v":{"v":205.54804791094466,"d":"205.5"}},118,12,90,12,2496,{"v":0.006451612903225712,"d":"1%"},{"v":205634.66666666663,"d":"205,635"}]
["built_t",{"$f":"CONCATENATE(\"T \",C146,\" x \",D146, \", \",E146,\" x \",F146)","v":"T 180 x 9, 100 x 9"},180,9,{"$f":"C146/2+10","v":100},{"$f":"D146","v":9},1620,{"$f":"C146*SQRT(360)/(D146-1)","v":{"v":426.9074841227312,"d":"426.9"}},{"$f":"C146","v":180},{"$f":"D146","v":9},{"$f":"E146","v":100},{"$f":"F146","v":9},{"$f":"I146*J146+K146*L146","v":2520},{"v":0.009615384615384581,"d":"1%"},{"v":372600,"d":"372,600"}]
["flat","F 180 x 13",180,14,{"v":262.7122979216808,"d":"263"},{"$f":"C147*D147","v":2520},2520,{"$f":"C147*SQRT(360)/(D147-1)","v":{"v":262.7122979216807,"d":"262.7"}},{"$f":"C147","v":180},{"$f":"D147","v":14},0,0,2520,{"v":0,"d":"0%"},{"v":291600,"d":"291,600"}]
["cropped_I","IPE 220 R_cropped",225,6.7,108,11.8,1507.5,{"$f":"C148*SQRT(360)/D148","v":{"v":637.1753494369123,"d":"637.2"}},186.39999999999998,6.7,108,11.8,{"v":2523.2799999999997,"d":"2523"},{"v":0.001301587301587137,"d":"0%"},{"v":428797.04533333326,"d":"428,797"}]
["L","L 150 x 75 x 12",150,12,75,12,1800,{"v":237.17082451262846,"d":"237.2"},138,12,75,12,2556,{"v":0.01296724897752144,"d":"1%"},{"v":247848,"d":"247,848"}]
["HP","HP 200*10.0",200,10,38,null,2000,{"v":379.47331922020555,"d":"379.5"},179.28,10,38,20.72,{"v":2580.16,"d":"2580"},{"v":9.452269170578953E-3,"d":"1%"},{"$f":"1/6*I150*(4*K150*L150+J150*I150+40*I150)","v":{"v":361949.58719999995,"d":"361,950"}}]
["half_I","IPE 300_half",300,7.1,150,10.7,2130,{"v":801.7041955356456,"d":"801.7"},139.3,7.1,150,10.7,{"v":2594.03,"d":"2594"},{"v":0.005375635619496499,"d":"1%"},{"v":301376.2465,"d":"301,376"}]
["half_I","IPE 270 O_half",274,7.5,136,12.2,2055,{"v":693.1712631089088,"d":"693.2"},124.8,7.5,136,12.2,{"v":2595.2,"d":"2595"},{"v":4.5103564723603107E-4,"d":"0%"},{"v":261347.83999999994,"d":"261,348"}]
["L","L  180*10.0*90*10.0",180,10,90,10,1800,{"v":341.525987298185,"d":"341.5"},170,10,90,10,2600,{"v":1.8495684340320562E-3,"d":"0%"},{"v":342833.3333333333,"d":"342,833"}]
["L","L  120*14.0*80*14.0",120,14,80,14,1680,{"v":162.63142252294523,"d":"162.6"},106,14,80,14,2604,{"v":1.5384615384614886E-3,"d":"0%"},{"v":180270.66666666666,"d":"180,271"}]
["flat","F 180 x 14",180,15,{"v":243.94713378441784,"d":"244"},{"$f":"C155*D155","v":2700},2700,{"$f":"C155*SQRT(360)/(D155-1)","v":{"v":243.94713378441784,"d":"243.9"}},{"$f":"C155","v":180},{"$f":"D155","v":15},0,0,2700,{"v":0.03686635944700467,"d":"4%"},{"v":297000,"d":"297,000"}]
["half_I","IPE 270 R_half",276,7.7,133,13.1,2125.2000000000003,{"$f":"C156*SQRT(360)/D156","v":{"v":680.0950396414073,"d":"680.1"}},124.9,7.7,133,13.1,{"v":2704.0299999999997,"d":"2704"},{"v":0.001492592592592601,"d":"0%"},{"v":269095.59283333336,"d":"269,096"}]
["built_t",{"$f":"CONCATENATE(\"T \",C157,\" x \",D157, \", \",E157,\" x \",F157)","v":"T 220 x 8, 120 x 8"},220,8,{"$f":"C157/2+10","v":120},{"$f":"D157","v":8},1760,{"$f":"C157*SQRT(360)/(D157-1)","v":{"v":596.3152159174658,"d":"596.3"}},{"$f":"C157","v":220},{"$f":"D157","v":8},{"$f":"E157","v":120},{"$f":"F157","v":8},{"$f":"I157*J157+K157*L157","v":2720},{"v":5.9059995636143725E-3,"d":"1%"},{"v":528000,"d":"528,000"}]
["L","L  150*12.0*90*12.0",150,12,90,12,1800,{"$f":"C158*SQRT(360)/D158","v":{"v":237.17082451262846,"d":"237.2"}},138,12,90,12,2736,{"v":0.00588235294117645,"d":"1%"},{"v":264408,"d":"264,408"}]
["L","L  160*12.0*80*12.0",160,12,80,12,1920,{"$f":"C159*SQRT(360)/D159","v":{"v":252.98221281347037,"d":"253.0"}},148,12,80,12,2736,{"v":0,"d":"0%"},{"v":284554.6666666666,"d":"284,555"}]
["cropped_I","IPE 240 O_cropped",242,7,122,10.8,1694,{"$f":"C160*SQRT(360)/D160","v":{"v":655.9467375092124,"d":"655.9"}},205.39999999999998,7,122,10.8,{"v":2755.3999999999996,"d":"2755"},{"v":0.007090643274853647,"d":"1%"},{"v":510905.1133333333,"d":"510,905"}]
["HP","HP 200*11.0",200,11,39,null,2200,{"$f":"C161*SQRT(360)/D161","v":{"v":344.9757447456414,"d":"345.0"}},179.28,11,39,20.72,{"v":2780.16,"d":"2780"},{"v":8.985991144661476E-3,"d":"1%"},{"v":369782.92799999996,"d":"369,783"}]
["built_t",{"$f":"CONCATENATE(\"T \",C162,\" x \",D162, \", \",E162,\" x \",F162)","v":"T 200 x 9, 110 x 9"},200,9,{"$f":"C162/2+10","v":110},{"$f":"D162","v":9},1800,{"$f":"C162*SQRT(360)/(D162-1)","v":{"v":474.3416490252569,"d":"474.3"}},{"$f":"C162","v":200},{"$f":"D162","v":9},{"$f":"E162","v":110},{"$f":"F162","v":9},{"$f":"I162*J162+K162*L162","v":2790},{"v":0.003539364640884113,"d":"0%"},{"v":458666.6666666666,"d":"458,667"}]
["L","L  200*9.0*90*12.0",200,9,90,12,1800,{"$f":"C163*SQRT(360)/D163","v":{"v":421.63702135578393,"d":"421.6"}},191,9,90,12,2799,{"v":3.225806451612856E-3,"d":"0%"},{"v":435448.1666666666,"d":"435,448"}]
["built_t",{"$f":"CONCATENATE(\"T \",C164,\" x \",D164, \", \",E164,\" x \",F164)","v":"T 180 x 10, 100 x 10"},180,10,{"$f":"C164/2+10","v":100},{"$f":"D164","v":10},1800,{"$f":"C164*SQRT(360)/(D164-1)","v":{"v":379.4733192202055,"d":"379.5"}},{"$f":"C164","v":180},{"$f":"D164","v":10},{"$f":"E164","v":100},{"$f":"F164","v":10},{"$f":"I164*J164+K164*L164","v":2800},{"v":3.5727045373357136E-4,"d":"0%"},{"v":390000,"d":"390,000"}]
["L","L  150*12.0*100*12.0",150,12,100,12,1800,{"$f":"C165*SQRT(360)/D165","v":{"v":237.17082451262846,"d":"237.2"}},138,12,100,12,2856,{"v":0.020000000000000018,"d":"2%"},{"v":275448,"d":"275,448"}]
["flat","F 180 x 15",180,16,{"v":227.68399153212331,"d":"228"},{"$f":"C166*D166","v":2880},2880,{"$f":"C166*SQRT(360)/(D166-1)","v":{"v":227.68399153212331,"d":"227.7"}},{"$f":"C166","v":180},{"$f":"D166","v":16},0,0,2880,{"v":0.008403361344537785,"d":"1%"},{"v":302400,"d":"302,400"}]
["HP","HP 200*11.5",200,11.5,39.5,null,2300,{"$f":"C167*SQRT(360)/D167","v":{"v":329.97679932191784,"d":"330.0"}},179.28,11.5,39.5,20.72,{"v":2880.16,"d":"2880"},{"v":5.5555555555475422E-5,"d":"0%"},{"v":373699.5984,"d":"373,700"}]
["L","L  200*10.0*100*10.0",200,10,100,10,2000,{"v":379.47331922020555,"d":"379.5"},190,10,100,10,2900,{"v":0.006888506194100419,"d":"1%"},{"v":427499.99999999994,"d":"427,500"}]
["HP","HP 220*10.0",220,10,41,null,2200,{"v":417.42065114222606,"d":"417.4"},197.06,10,41,22.94,{"v":2911.14,"d":"2911"},{"v":3.8413793103448945E-3,"d":"0%"},{"v":447167.23826666665,"d":"447,167"}]
["cropped_I","IPE 270_cropped",270,6.6,135,10.2,1782,{"v":776.1954256776932,"d":"776.2"},234.60000000000002,6.6,135,10.2,{"v":2925.36,"d":"2925"},{"v":4.884684350460633E-3,"d":"0%"},{"v":642818.076,"d":"642,818"}]
["HP","HP 200*12.0",200,12,40,null,2400,{"v":316.22776601683796,"d":"316.2"},179.28,12,40,20.72,{"v":2980.16,"d":"2980"},{"v":0.018732737167391322,"d":"2%"},{"v":377616.26879999996,"d":"377,616"}]
["cropped_I","IPE 240 R_cropped",245,7.5,118,12.3,1837.5,{"v":619.8064213930024,"d":"619.8"},205.39999999999998,7.5,118,12.3,{"v":2991.8999999999996,"d":"2992"},{"v":0.00393938580478892,"d":"0%"},{"v":532742.5566666665,"d":"532,743"}]
["flat","F 200 x 14",200,15,{"v":271.05237087157536,"d":"271"},{"$f":"C173*D173","v":3000},3000,{"$f":"C173*SQRT(360)/(D173-1)","v":{"v":271.05237087157536,"d":"271.1"}},{"$f":"C173","v":200},{"$f":"D173","v":15},0,0,3000,{"v":0.002707309736288188,"d":"0%"},{"v":366666.6666666666,"d":"366,667"}]
["L","L  225*9.0*90*12.0",225,9,90,12,2025,{"$f":"C174*SQRT(360)/D174","v":{"v":474.3416490252569,"d":"474.3"}},216,9,90,12,3024,{"v":0.008000000000000007,"d":"1%"},{"v":536544,"d":"536,544"}]
["half_I","IPE 300 O_half",304,8,152,12.7,2432,{"$f":"C175*SQRT(360)/D175","v":{"v":720.9993065183905,"d":"721.0"}},139.3,8,152,12.7,{"v":3044.8,"d":"3045"},{"v":0.006878306878306928,"d":"1%"},{"v":334505.73333333334,"d":"334,506"}]
["built_t",{"$f":"CONCATENATE(\"T \",C176,\" x \",D176, \", \",E176,\" x \",F176)","v":"T 220 x 9, 120 x 9"},220,9,{"$f":"C176/2+10","v":120},{"$f":"D176","v":9},1980,{"$f":"C176*SQRT(360)/(D176-1)","v":{"v":521.7758139277826,"d":"521.8"}},{"$f":"C176","v":220},9,120,9,{"$f":"I176*J176+K176*L176","v":3060},{"v":4.99211770888075E-3,"d":"0%"},{"v":553666.6666666666,"d":"553,667"}]
["built_t",{"$f":"CONCATENATE(\"T \",C177,\" x \",D177, \", \",E177,\" x \",F177)","v":"T 180 x 11, 100 x 11"},180,11,{"$f":"C177/2+10","v":100},{"$f":"D177","v":11},1980,{"$f":"C177*SQRT(360)/(D177-1)","v":{"v":341.525987298185,"d":"341.5"}},180,11,100,11,{"$f":"I177*J177+K177*L177","v":3080},{"v":0.006535947712418277,"d":"1%"},{"v":407400,"d":"407,400"}]
["L","L  180*12.0*90*12.0",180,12,90,12,2160,{"$f":"C178*SQRT(360)/D178","v":{"v":284.60498941515414,"d":"284.6"}},168,12,90,12,3096,{"v":5.1948051948051965E-3,"d":"1%"},{"v":365568,"d":"365,568"}]
["built_t",{"$f":"CONCATENATE(\"T \",C179,\" x \",D179, \", \",E179,\" x \",F179)","v":"T 200 x 10, 110 x 10"},200,10,{"$f":"C179/2+10","v":110},{"$f":"D179","v":10},2000,{"$f":"C179*SQRT(360)/(D179-1)","v":{"v":421.63702135578393,"d":"421.6"}},{"$f":"C179","v":200},{"$f":"D179","v":10},{"$f":"E179","v":110},{"$f":"F179","v":10},{"$f":"I179*J179+K179*L179","v":3100},{"v":1.2919896640826156E-3,"d":"0%"},{"v":479999.99999999994,"d":"480,000"}]
["HP","HP 220*11.0",220,11,42,null,2420,{"$f":"C180*SQRT(360)/D180","v":{"v":379.4733192202055,"d":"379.5"}},197.06,11,42,22.94,{"v":3131.14,"d":"3131"},{"v":0.010045161290322513,"d":"1%"},{"v":456653.0498,"d":"456,653"}]
["L","L 150 x 75 x 15",150,15,75,15,2250,{"$f":"C181*SQRT(360)/D181","v":{"v":189.73665961010278,"d":"189.7"}},135,15,75,15,3150,{"v":0.006023365291874638,"d":"1%"},{"v":268312.5,"d":"268,313"}]
["L","L  160*14.0*80*14.0",160,14,80,14,2240,{"$f":"C182*SQRT(360)/D182","v":{"v":216.84189669726032,"d":"216.8"}},146,14,80,14,3164,{"v":0.004444444444444473,"d":"0%"},{"v":300857.3333333333,"d":"300,857"}]
["half_I","IPE 300 R_half",306,8.5,147,13.7,2601,{"$f":"C183*SQRT(360)/D183","v":{"v":683.05197459637,"d":"683.1"}},139.3,8.5,147,13.7,{"v":3197.95,"d":"3198"},{"v":0.010730088495575218,"d":"1%"},{"v":343877.14083333337,"d":"343,877"}]
["flat","F 200 x 15",200,16,{"v":252.98221281347037,"d":"253"},{"$f":"C184*D184","v":3200},3200,{"$f":"C184*SQRT(360)/(D184-1)","v":{"v":252.98221281347034,"d":"253.0"}},{"$f":"C184","v":200},{"$f":"D184","v":16},0,0,3200,{"v":6.4103566347206709E-4,"d":"0%"},{"v":373333.33333333326,"d":"373,333"}]
["HP","HP 220*11.5",220,11.5,42.5,null,2530,{"$f":"C185*SQRT(360)/D185","v":{"v":362.9744792541096,"d":"363.0"}},197.06,11.5,42.5,22.94,{"v":3241.1400000000003,"d":"3241"},{"v":0.012856250000000014,"d":"1%"},{"v":461395.9555666667,"d":"461,396"}]
["L","L  200*10.5*90*14.0",200,10.5,90,14,2100,{"$f":"C186*SQRT(360)/D186","v":{"v":361.4031611621005,"d":"361.4"}},189.5,10.5,90,14,{"v":3249.75,"d":"3250"},{"v":2.6564727225604212E-3,"d":"0%"},{"v":461424.6041666666,"d":"461,425"}]
["HP","HP 240*10.0",240,10,44,null,2400,{"$f":"C187*SQRT(360)/D187","v":{"v":455.36798306424663,"d":"455.4"}},214.84,10,44,25.16,{"v":3255.44,"d":"3255"},{"v":1.7509039156857753E-3,"d":"0%"},{"v":543192.8624,"d":"543,193"}]
["L","L  250*10.0*90*10.0",250,10,90,10,2500,{"$f":"C188*SQRT(360)/D188","v":{"v":474.3416490252569,"d":"474.3"}},240,10,90,10,3300,{"v":0.013687857862531683,"d":"1%"},{"v":624000,"d":"624,000"}]
["L","L  150*14.0*100*14.0",150,14,100,14,2100,{"$f":"C189*SQRT(360)/D189","v":{"v":203.28927815368155,"d":"203.3"}},136,14,100,14,3304,{"v":0.00121212121212122,"d":"0%"},{"v":293397.3333333333,"d":"293,397"}]
["built_t",{"$f":"CONCATENATE(\"T \",C190,\" x \",D190, \", \",E190,\" x \",F190)","v":"T 240 x 9, 130 x 9"},240,9,{"$f":"C190/2+10","v":130},{"$f":"D190","v":9},2160,{"$f":"C190*SQRT(360)/(D190-1)","v":{"v":569.2099788303083,"d":"569.2"}},{"$f":"C190","v":240},{"$f":"D190","v":9},{"$f":"E190","v":130},{"$f":"F190","v":9},{"$f":"I190*J190+K190*L190","v":3330},{"v":0.007869249394673039,"d":"1%"},{"v":657600,"d":"657,600"}]
["L","L  250*9.0*90*13.0",250,9,90,13,2250,{"$f":"C191*SQRT(360)/D191","v":{"v":527.0462766947298,"d":"527.0"}},241,9,90,13,3339,{"v":0.002702702702702675,"d":"0%"},{"v":662308.1666666666,"d":"662,308"}]
["HP","HP 220*12.0",220,12,43,null,2640,{"$f":"C192*SQRT(360)/D192","v":{"v":347.85054261852173,"d":"347.9"}},197.06,12,43,22.94,{"v":3351.1400000000003,"d":"3351"},{"v":3.635819107517424E-3,"d":"0%"},{"v":466138.8613333333,"d":"466,139"}]
["built_t",{"$f":"CONCATENATE(\"T \",C193,\" x \",D193, \", \",E193,\" x \",F193)","v":"T 180 x 12, 100 x 12"},180,12,{"$f":"C193/2+10","v":100},{"$f":"D193","v":12},2160,{"$f":"C193*SQRT(360)/(D193-1)","v":{"v":310.47817027107726,"d":"310.5"}},{"$f":"C193","v":180},{"$f":"D193","v":12},{"$f":"E193","v":100},{"$f":"F193","v":12},{"$f":"I193*J193+K193*L193","v":3360},{"v":2.64387641220587E-3,"d":"0%"},{"v":424800,"d":"424,800"}]
["L","L 150 x 90 x 15",150,15,90,15,2250,{"$f":"C194*SQRT(360)/D194","v":{"v":189.73665961010278,"d":"189.7"}},135,15,90,15,3375,{"v":4.4642857142858094E-3,"d":"0%"},{"v":288562.5,"d":"288,563"}]
["built_t",{"$f":"CONCATENATE(\"T \",C195,\" x \",D195, \", \",E195,\" x \",F195)","v":"T 220 x 10, 120 x 10"},220,10,{"$f":"C195/2+10","v":120},{"$f":"D195","v":10},2200,{"$f":"C195*SQRT(360)/(D195-1)","v":{"v":463.8007234913623,"d":"463.8"}},{"$f":"C195","v":220},{"$f":"D195","v":10},{"$f":"E195","v":120},{"$f":"F195","v":10},{"$f":"I195*J195+K195*L195","v":3400},{"v":0.007407407407407307,"d":"1%"},{"v":579333.3333333333,"d":"579,333"}]
["flat","F 200 x 16",200,17,{"v":237.17082451262846,"d":"237"},{"$f":"C196*D196","v":3400},3400,{"$f":"C196*SQRT(360)/(D196-1)","v":{"v":237.17082451262846,"d":"237.2"}},{"$f":"C196","v":200},{"$f":"D196","v":17},0,0,3400,{"$f":"M196/M195-1","v":{"v":0,"d":"0%"}},{"v":379999.99999999994,"d":"380,000"}]
["built_t",{"$f":"CONCATENATE(\"T \",C197,\" x \",D197, \", \",E197,\" x \",F197)","v":"T 200 x 11, 110 x 11"},200,11,{"$f":"C197/2+10","v":110},{"$f":"D197","v":11},{"$f":"C197*D197","v":2200},{"$f":"C197*SQRT(360)/(D197-1)","v":{"v":379.47331922020555,"d":"379.5"}},{"$f":"C197","v":200},{"$f":"D197","v":11},{"$f":"E197","v":110},{"$f":"F197","v":11},{"$f":"I197*J197+K197*L197","v":3410},{"v":0.002941176470588225,"d":"0%"},{"v":501333.33333333326,"d":"501,333"}]
["cropped_I","IPE 270 O_cropped",274,7.5,136,12.2,2055,{"$f":"C198*SQRT(360)/D198","v":{"v":693.1712631089088,"d":"693.2"}},234.60000000000002,7.5,136,12.2,{"v":3418.7,"d":"3419"},{"v":2.5513196480937417E-3,"d":"0%"},{"v":695209.73,"d":"695,210"}]
["L","L  200*12.0*100*12.0",200,12,100,12,2400,{"v":316.22776601683796,"d":"316.2"},188,12,100,12,3456,{"v":0.010910580045046414,"d":"1%"},{"v":456714.6666666666,"d":"456,715"}]
["cropped_I","IPE 300_cropped",300,7.1,150,10.7,2130,{"v":801.7041955356456,"d":"801.7"},263.6,7.1,150,10.7,{"v":3476.5600000000004,"d":"3477"},{"v":0.00594907407407419,"d":"1%"},{"v":827508.936,"d":"827,509"}]
["half_I","IPE 330 O_half",334,8.5,162,13.5,2839,{"v":745.5534624679332,"d":"745.6"},153.5,8.5,162,13.5,{"v":3491.75,"d":"3492"},{"v":0.004369261568907046,"d":"0%"},{"v":414264.5208333333,"d":"414,265"}]
["HP","HP 240*11.0",240,11,45,null,2640,{"v":413.97089369476964,"d":"414.0"},214.84,11,45,25.16,{"v":3495.4400000000005,"d":"3495"},{"v":1.0567766879072682E-3,"d":"0%"},{"v":554489.1496,"d":"554,489"}]
["L","L  225*10.5*90*14.0",225,10.5,90,14,2362.5,{"v":406.5785563073631,"d":"406.6"},214.5,10.5,90,14,{"v":3512.25,"d":"3512"},{"v":0.004809122742773342,"d":"0%"},{"v":567432.9375,"d":"567,433"}]
["L","L  200*11.5*90*15.0",200,11.5,90,15,2300,{"v":329.97679932191784,"d":"330.0"},188.5,11.5,90,15,{"v":3517.75,"d":"3518"},{"v":1.5659477542886435E-3,"d":"0%"},{"v":474635.1458333333,"d":"474,635"}]
["flat","F 220 x 16",220,16,{"v":278.2804340948174,"d":"278"},{"$f":"C205*D205","v":3520},3520,{"$f":"C205*SQRT(360)/(D205-1)","v":{"v":278.2804340948174,"d":"278.3"}},{"$f":"C205","v":220},{"$f":"D205","v":16},0,0,3520,{"v":6.396133892403455E-4,"d":"0%"},{"v":451733.3333333333,"d":"451,733"}]
["cropped_I","IPE 270 R_cropped",276,7.7,133,13.1,2125.2000000000003,{"$f":"C206*SQRT(360)/D206","v":{"v":680.0950396414073,"d":"680.1"}},234.79999999999998,7.7,133,13.1,{"v":3550.2599999999998,"d":"3550"},{"v":0.008596590909090818,"d":"1%"},{"v":711019.7946666665,"d":"711,020"}]
["L","L  180*14.0*90*14.0",180,14,90,14,2520,{"$f":"C207*SQRT(360)/D207","v":{"v":243.94713378441784,"d":"243.9"}},166,14,90,14,3584,{"v":0.009503529318979576,"d":"1%"},{"v":387443.99999999994,"d":"387,444"}]
["flat","F 220 x 15",200,18,{"v":223.21959954129738,"d":"223"},{"$f":"C208*D208","v":3600},3600,{"$f":"C208*SQRT(360)/(D208-1)","v":{"v":223.21959954129738,"d":"223.2"}},{"$f":"C208","v":200},{"$f":"D208","v":18},0,0,3600,{"v":4.4642857142858094E-3,"d":"0%"},{"v":386666.6666666666,"d":"386,667"}]
["HP","HP 260*10.0",260,10,47,null,2600,{"$f":"C209*SQRT(360)/D209","v":{"v":493.3153149862672,"d":"493.3"}},232.62,10,47,27.38,{"v":3613.0599999999995,"d":"3613"},{"v":3.6277777777775633E-3,"d":"0%"},{"v":650500.1187999999,"d":"650,500"}]
["built_t",{"$f":"CONCATENATE(\"T \",C210,\" x \",D210, \", \",E210,\" x \",F210)","v":"T 240 x 10, 130 x 10"},240,10,{"$f":"C210/2+10","v":130},{"$f":"D210","v":10},2400,{"$f":"C210*SQRT(360)/(D210-1)","v":{"v":505.9644256269407,"d":"506.0"}},{"$f":"C210","v":240},{"$f":"D210","v":10},{"$f":"E210","v":130},{"$f":"F210","v":10},{"$f":"I210*J210+K210*L210","v":3700},{"v":0.02406270585044279,"d":"2%"},{"v":688000,"d":"688,000"}]
["half_I","IPE 330 R _half",336,9.2,158,14.5,3091.2,{"$f":"C211*SQRT(360)/D211","v":{"v":692.9512785760274,"d":"693.0"}},153.5,9.2,158,14.5,{"v":3703.2,"d":"3703"},{"v":8.6486486486481162E-4,"d":"0%"},{"v":427656.11666666664,"d":"427,656"}]
["built_t",{"$f":"CONCATENATE(\"T \",C212,\" x \",D212, \", \",E212,\" x \",F212)","v":"T 200 x 12, 110 x 12"},200,12,{"$f":"C212/2+10","v":110},{"$f":"D212","v":12},2400,{"$f":"C212*SQRT(360)/(D212-1)","v":{"v":344.9757447456414,"d":"345.0"}},{"$f":"C212","v":200},{"$f":"D212","v":12},{"$f":"E212","v":110},{"$f":"F212","v":12},{"$f":"I212*J212+K212*L212","v":3720},{"v":0.004536616979909258,"d":"0%"},{"v":522666.66666666657,"d":"522,667"}]
["HP","HP 240*12.0",240,12,46,null,2880,{"$f":"C213*SQRT(360)/D213","v":{"v":379.4733192202055,"d":"379.5"}},214.84,12,46,25.16,{"v":3735.4399999999996,"d":"3735"},{"v":0.004150537634408424,"d":"0%"},{"v":565785.4367999999,"d":"565,785"}]
["built_t",{"$f":"CONCATENATE(\"T \",C214,\" x \",D214, \", \",E214,\" x \",F214)","v":"T 220 x 11, 120 x 11"},220,11,{"$f":"C214/2+10","v":120},{"$f":"D214","v":11},2420,{"$f":"C214*SQRT(360)/(D214-1)","v":{"v":417.42065114222606,"d":"417.4"}},{"$f":"C214","v":220},{"$f":"D214","v":11},{"$f":"E214","v":120},{"$f":"F214","v":11},{"$f":"I214*J214+K214*L214","v":3740},{"v":1.2207397254406782E-3,"d":"0%"},{"$f":"1/6*I214*(4*K214*L214+J214*I214+40*I214)","v":{"v":605000,"d":"605,000"}}]
["flat","F 200 x 18",220,17,{"v":260.8879069638913,"d":"261"},{"$f":"C215*D215","v":3740},3740,{"$f":"C215*SQRT(360)/(D215-1)","v":{"v":260.8879069638913,"d":"260.9"}},{"$f":"C215","v":220},{"$f":"D215","v":17},0,0,3740,{"v":0,"d":"0%"},{"v":459799.99999999994,"d":"459,800"}]
["flat","F 200 x 17",200,19,{"v":210.81851067789196,"d":"211"},{"$f":"C216*D216","v":3800},3800,{"$f":"C216*SQRT(360)/(D216-1)","v":{"v":210.81851067789196,"d":"210.8"}},{"$f":"C216","v":200},{"$f":"D216","v":19},0,0,3800,{"v":0.016042780748663166,"d":"2%"},{"v":393333.33333333326,"d":"393,333"}]
["L","L  225*11.5*90*15.0",225,11.5,90,15,2587.5,{"$f":"C217*SQRT(360)/D217","v":{"v":371.2238992371576,"d":"371.2"}},213.5,11.5,90,15,{"v":3805.25,"d":"3805"},{"v":1.3815789473683449E-3,"d":"0%"},{"v":583397.6458333333,"d":"583,398"}]
["L","L  250*10.5*90*15.0",250,10.5,90,15,2625,{"$f":"C218*SQRT(360)/D218","v":{"v":451.75395145262564,"d":"451.8"}},239.5,10.5,90,15,{"v":3864.75,"d":"3865"},{"v":0.015636291965048343,"d":"2%"},{"v":698332.1041666666,"d":"698,332"}]
["HP","HP 260*11.0",260,11,48,null,2860,{"$f":"C219*SQRT(360)/D219","v":{"v":448.4684681693338,"d":"448.5"}},232.62,11,48,27.38,{"v":3873.0600000000004,"d":"3873"},{"v":2.1502037647973538E-3,"d":"0%"},{"v":663764.8866,"d":"663,765"}]
["L","L  250*12.0*90*12.0",250,12,90,12,3000,{"$f":"C220*SQRT(360)/D220","v":{"v":395.28470752104744,"d":"395.3"}},238,12,90,12,3936,{"v":0.016250716487738348,"d":"2%"},{"v":662274.6666666666,"d":"662,275"}]
["flat","F 220 x 17",220,18,{"v":245.5415594954271,"d":"246"},{"$f":"C221*D221","v":3960},3960,{"$f":"C221*SQRT(360)/(D221-1)","v":{"v":245.5415594954271,"d":"245.5"}},{"$f":"C221","v":220},{"$f":"D221","v":18},0,0,3960,{"v":6.0975609756097615E-3,"d":"1%"},{"v":467866.6666666666,"d":"467,867"}]
["built_t",{"$f":"CONCATENATE(\"T \",C222,\" x \",D222, \", \",E222,\" x \",F222)","v":"T 260 x 10, 140 x 10"},260,10,{"$f":"C222/2+10","v":140},{"$f":"D222","v":10},2600,{"$f":"C222*SQRT(360)/(D222-1)","v":{"v":548.1281277625191,"d":"548.1"}},{"$f":"C222","v":260},{"$f":"D222","v":10},{"$f":"E222","v":140},{"$f":"F222","v":10},{"$f":"I222*J222+K222*L222","v":4000},{"v":0.010101010101010166,"d":"1%"},{"v":805999.9999999999,"d":"806,000"}]
["L","L  200*14.0*100*14.0",200,14,100,14,2800,{"$f":"C223*SQRT(360)/D223","v":{"v":271.05237087157536,"d":"271.1"}},186,14,100,14,4004,{"v":9.9999999999988987E-4,"d":"0%"},{"v":484964,"d":"484,964"}]
["cropped_I","IPE 300 O_cropped",304,8,152,12.7,2432,{"$f":"C224*SQRT(360)/D224","v":{"v":720.9993065183905,"d":"721.0"}},260.6,8,152,12.7,{"v":4015.2,"d":"4015"},{"v":0.002797202797202747,"d":"0%"},{"v":878673.7066666668,"d":"878,674"}]
["L","L 200 x 150 x 12",200,12,150,12,2400,{"$f":"C225*SQRT(360)/D225","v":{"v":316.22776601683796,"d":"316.2"}},188,12,150,12,4056,{"v":0.010161386730424438,"d":"1%"},{"v":531914.6666666666,"d":"531,915"}]
["half_I","IPE 360 O _half",364,9.2,172,14.7,3348.7999999999997,{"$f":"C226*SQRT(360)/D226","v":{"v":750.6972184573632,"d":"750.7"}},167.3,9.2,172,14.7,{"v":4067.5600000000004,"d":"4068"},{"v":2.8500986193293887E-3,"d":"0%"},{"v":511513.058,"d":"511,513"}]
["built_t",{"$f":"CONCATENATE(\"T \",C227,\" x \",D227, \", \",E227,\" x \",F227)","v":"T 240 x 11, 130 x 11"},240,11,{"$f":"C227/2+10","v":130},{"$f":"D227","v":11},2640,{"$f":"C227*SQRT(360)/(D227-1)","v":{"v":455.36798306424663,"d":"455.4"}},{"$f":"C227","v":240},{"$f":"D227","v":11},{"$f":"E227","v":130},{"$f":"F227","v":11},{"$f":"I227*J227+K227*L227","v":4070},{"v":5.9986822566826525E-4,"d":"0%"},{"v":718400,"d":"718,400"}]
["HP","HP 260*12.0",260,12,49,null,3120,{"$f":"C228*SQRT(360)/D228","v":{"v":411.0960958218893,"d":"411.1"}},232.62,12,49,27.38,{"v":4133.0599999999995,"d":"4133"},{"v":0.015493857493857455,"d":"2%"},{"v":677029.6544,"d":"677,030"}]
["L","L  275*10.5*100*14.0",275,10.5,100,14,2887.5,{"$f":"C229*SQRT(360)/D229","v":{"v":496.9293465978882,"d":"496.9"}},264.5,10.5,100,14,{"v":4177.25,"d":"4177"},{"v":0.010691836073030814,"d":"1%"},{"v":835698.7708333333,"d":"835,699"}]
["flat","F 220 x 18",220,19,{"v":231.90036174568115,"d":"232"},{"$f":"C230*D230","v":4180},4180,{"$f":"C230*SQRT(360)/(D230-1)","v":{"v":231.90036174568115,"d":"231.9"}},{"$f":"C230","v":220},{"$f":"D230","v":19},0,0,4180,{"v":6.5832784726804761E-4,"d":"0%"},{"v":475933.3333333333,"d":"475,933"}]
["L","L  250*11.5*90*16.0",250,11.5,90,16,2875,{"$f":"C231*SQRT(360)/D231","v":{"v":412.4709991523973,"d":"412.5"}},238.5,11.5,90,16,{"v":4182.75,"d":"4183"},{"v":6.5789473684207955E-4,"d":"0%"},{"v":717199.3125,"d":"717,199"}]
["cropped_I","IPE 300 R_cropped",306,8.5,147,13.7,2601,{"$f":"C232*SQRT(360)/D232","v":{"v":683.05197459637,"d":"683.1"}},260.6,8.5,147,13.7,4229,{"v":0.011057318749626344,"d":"1%"},{"v":898839.8033333335,"d":"898,840"}]
["HP","HP 280*11.0",280,11,51,null,3080,{"$f":"C233*SQRT(360)/D233","v":{"v":482.96604264389794,"d":"483.0"}},250.4,11,51,29.6,4264,{"v":0.008276188224166425,"d":"1%"},{"v":784953.9200000002,"d":"784,954"}]
["L","L 200 x 100 x 15",200,15,100,15,3000,{"$f":"C234*SQRT(360)/D234","v":{"v":252.98221281347034,"d":"253.0"}},185,15,100,15,4275,{"v":0.002579737335834942,"d":"0%"},{"v":498729.1666666666,"d":"498,729"}]
["built_t",{"$f":"CONCATENATE(\"T \",C235,\" x \",D235, \", \",E235,\" x \",F235)","v":"T 280 x 10, 150 x 10"},280,10,{"$f":"C235/2+10","v":150},{"$f":"D235","v":10},2800,{"$f":"C235*SQRT(360)/(D235-1)","v":{"v":590.2918298980975,"d":"590.3"}},{"$f":"C235","v":280},{"$f":"D235","v":10},{"$f":"E235","v":150},{"$f":"F235","v":10},{"$f":"I235*J235+K235*L235","v":4300},{"v":0.005847953216374213,"d":"1%"},{"v":933333.3333333333,"d":"933,333"}]
["flat","F 240 x 17",240,18,{"v":267.86351944955686,"d":"268"},{"$f":"C236*D236","v":4320},4320,{"$f":"C236*SQRT(360)/(D236-1)","v":{"v":267.86351944955686,"d":"267.9"}},{"$f":"C236","v":240},{"$f":"D236","v":18},0,0,4320,{"v":4.6511627906977715E-3,"d":"0%"},{"v":556800,"d":"556,800"}]
["half_I","IPE 360 R _half",366,9.9,168,16,3623.4,{"$f":"C237*SQRT(360)/D237","v":{"v":701.4506809828041,"d":"701.5"}},167,9.9,168,16,{"v":4341.3,"d":"4341"},{"v":0.00493055555555566,"d":"0%"},{"v":531207.5166666666,"d":"531,208"}]
["HP","HP 260*13.0",260,13,50,null,3380,{"$f":"C238*SQRT(360)/D238","v":{"v":379.47331922020555,"d":"379.5"}},232.62,13,50,27.38,{"v":4393.0599999999995,"d":"4393"},{"v":0.011922695966645858,"d":"1%"},{"v":690294.4221999999,"d":"690,294"}]
["built_t",{"$f":"CONCATENATE(\"T \",C239,\" x \",D239, \", \",E239,\" x \",F239)","v":"T 260 x 11, 140 x 11"},260,11,{"$f":"C239/2+10","v":140},{"$f":"D239","v":11},2860,{"$f":"C239*SQRT(360)/(D239-1)","v":{"v":493.3153149862672,"d":"493.3"}},{"$f":"C239","v":260},{"$f":"D239","v":11},{"$f":"E239","v":140},{"$f":"F239","v":11},{"$f":"I239*J239+K239*L239","v":4400},{"v":1.5797644466499783E-3,"d":"0%"},{"v":841533.3333333333,"d":"841,533"}]
["L","L  275*11.5*100*15.0",275,11.5,100,15,3162.5,{"$f":"C240*SQRT(360)/D240","v":{"v":453.718099067637,"d":"453.7"}},263.5,11.5,100,15,{"v":4530.25,"d":"4530"},{"v":0.02960227272727267,"d":"3%"},{"v":859460.1458333333,"d":"859,460"}]
["L","L  300*10.5*100*15.0",300,10.5,100,15,3150,{"$f":"C241*SQRT(360)/D241","v":{"v":542.1047417431507,"d":"542.1"}},289.5,10.5,100,15,{"v":4539.75,"d":"4540"},{"v":2.0970145135477125E-3,"d":"0%"},{"v":994902.9375,"d":"994,903"}]
["HP","HP 280*12.0",280,12,52,null,3360,{"$f":"C242*SQRT(360)/D242","v":{"v":442.71887242357315,"d":"442.7"}},250.4,12,52,29.6,4544,{"v":9.3617489949893162E-4,"d":"0%"},{"v":800345.1733333333,"d":"800,345"}]
["L","L  200*16.0*100*16.0",200,16,100,16,3200,{"$f":"C243*SQRT(360)/D243","v":{"v":237.17082451262846,"d":"237.2"}},184,16,100,16,4544,{"v":0,"d":"0%"},{"v":512255.99999999994,"d":"512,256"}]
["flat","F 240 x 18",240,19,{"v":252.98221281347037,"d":"253"},{"$f":"C244*D244","v":4560},4560,{"$f":"C244*SQRT(360)/(D244-1)","v":{"v":252.98221281347034,"d":"253.0"}},{"$f":"C244","v":240},{"$f":"D244","v":19},0,0,4560,{"v":3.5211267605634866E-3,"d":"0%"},{"v":566400,"d":"566,400"}]
["L","L  250*14.0*90*14.0",250,14,90,14,3500,{"$f":"C245*SQRT(360)/D245","v":{"v":338.81546358946923,"d":"338.8"}},236,14,90,14,4564,{"v":8.7719298245603206E-4,"d":"0%"},{"v":699503.9999999999,"d":"699,504"}]
["half_I","IPE 400 O _half",404,9.7,182,15.5,3918.7999999999997,{"$f":"C246*SQRT(360)/D246","v":{"v":790.243407035892,"d":"790.2"}},186.5,9.7,182,15.5,{"v":4630.05,"d":"4630"},{"v":0.01447195442594218,"d":"1%"},{"v":638857.3041666666,"d":"638,857"}]
["cropped_I","IPE 330 O_cropped",334,8.5,162,13.5,2839,{"$f":"C247*SQRT(360)/D247","v":{"v":745.5534624679332,"d":"745.6"}},289,8.5,162,13.5,{"v":4643.5,"d":"4644"},{"v":2.9049362317901117E-3,"d":"0%"},{"v":1096490.0833333333,"d":"1,096,490"}]
["HP","HP 300*11.0",300,11,54,null,3300,{"$f":"C248*SQRT(360)/D248","v":{"v":517.4636171184621,"d":"517.5"}},268.18,11,54,31.82,{"v":4668.26,"d":"4668"},{"v":0.005332184774415882,"d":"1%"},{"v":918529.9090000001,"d":"918,530"}]
["built_t",{"$f":"CONCATENATE(\"T \",C249,\" x \",D249, \", \",E249,\" x \",F249)","v":"T 280 x 11, 150 x 11"},280,11,{"$f":"C249/2+10","v":150},{"$f":"D249","v":11},3080,{"$f":"C249*SQRT(360)/(D249-1)","v":{"v":531.2626469082877,"d":"531.3"}},{"$f":"C249","v":280},11,150,11,{"$f":"I249*J249+K249*L249","v":4730},{"v":0.013225484441740543,"d":"1%"},{"v":974400,"d":"974,400"}]
["built_t",{"$f":"CONCATENATE(\"T \",C250,\" x \",D250, \", \",E250,\" x \",F250)","v":"T 260 x 12, 140 x 12"},260,12,{"$f":"C250/2+10","v":140},{"$f":"D250","v":12},3120,{"$f":"C250*SQRT(360)/(D250-1)","v":{"v":448.4684681693338,"d":"448.5"}},260,12,140,12,{"$f":"I250*J250+K250*L250","v":4800},{"v":0.014799154334038,"d":"1%"},{"v":877066.6666666666,"d":"877,067"}]
["HP","HP 280*13.0",280,13,53,null,3640,{"$f":"C251*SQRT(360)/D251","v":{"v":408.6635745448367,"d":"408.7"}},250.4,13,53,29.6,4824,{"v":0.004999999999999893,"d":"0%"},{"v":815736.4266666668,"d":"815,736"}]
["L","L  300*11.5*100*16.0",300,11.5,100,16,3450,{"$f":"C252*SQRT(360)/D252","v":{"v":494.9651989828768,"d":"495.0"}},288.5,11.5,100,16,{"v":4917.75,"d":"4918"},{"v":0.019434079601990062,"d":"2%"},{"v":1022143.4791666665,"d":"1,022,143"}]
["flat","F 260 x 18",260,19,{"v":274.06406388125953,"d":"274"},{"$f":"C253*D253","v":4940},4940,{"$f":"C253*SQRT(360)/(D253-1)","v":{"v":274.06406388125953,"d":"274.1"}},{"$f":"C253","v":260},{"$f":"D253","v":19},0,0,4940,{"v":4.5244268212087935E-3,"d":"0%"},{"v":664733.3333333333,"d":"664,733"}]
["cropped_I","IPE 330 R _cropped",336,9.2,158,14.5,3091.2,{"$f":"C254*SQRT(360)/D254","v":{"v":692.9512785760274,"d":"693.0"}},289,9.2,158,14.5,{"v":4949.799999999999,"d":"4950"},{"v":1.9838056680161475E-3,"d":"0%"},{"v":1126271.5333333332,"d":"1,126,272"}]
["HP","HP 300*12.0",300,12,55,null,3600,{"v":474.3416490252569,"d":"474.3"},268.18,12,55,31.82,{"v":4968.26,"d":"4968"},{"v":3.7294436138834985E-3,"d":"0%"},{"v":936205.6528,"d":"936,206"}]
["L","L  325*10.5*120*14.0",325,10.5,120,14,3412.5,{"v":587.2801368884133,"d":"587.3"},314.5,10.5,120,14,{"v":4982.25,"d":"4982"},{"v":0.002815875175614657,"d":"0%"},{"v":1184734.6041666665,"d":"1,184,735"}]
["half_I","IPE 400 R _half",407,10.6,178,17,4314.2,{"v":728.517174163319,"d":"728.5"},186.5,10.6,178,17,{"v":5002.9,"d":"5003"},{"v":0.00414471373375469,"d":"0%"},{"v":669562.975,"d":"669,563"}]
["L","L 200 x 150 x 15",200,15,150,15,3000,{"v":252.98221281347034,"d":"253.0"},185,15,150,15,5025,{"v":0.004417437886026221,"d":"0%"},{"v":591229.1666666666,"d":"591,229"}]
["HP","HP 280*14.0",280,14,54,null,3920,{"v":379.47331922020555,"d":"379.5"},250.4,14,54,29.6,5104,{"v":0.015721393034825892,"d":"2%"},{"v":831127.68,"d":"831,128"}]
["built_t",{"$f":"CONCATENATE(\"T \",C260,\" x \",D260, \", \",E260,\" x \",F260)","v":"T 280 x 12, 150 x 12"},280,12,{"$f":"C260/2+10","v":150},{"$f":"D260","v":12},3360,{"$f":"C260*SQRT(360)/(D260-1)","v":{"v":482.96604264389794,"d":"483.0"}},{"$f":"C260","v":280},{"$f":"D260","v":12},{"$f":"E260","v":150},{"$f":"F260","v":12},{"$f":"I260*J260+K260*L260","v":5160},{"$f":"M260/M259-1","v":{"v":0.01097178683385569,"d":"1%"}},{"v":1015466.6666666666,"d":"1,015,467"}]
["half_I","IPE 400 V _half",408,10.6,182,17.5,{"$f":"C261*D261","v":4324.8},{"$f":"C261*SQRT(360)/D261","v":{"v":730.3071426502069,"d":"730.3"}},186.5,10.6,182,17.5,{"v":5161.9,"d":"5162"},{"v":3.6821705426359763E-4,"d":"0%"},{"v":689331.975,"d":"689,332"}]
["built_t",{"$f":"CONCATENATE(\"T \",C262,\" x \",D262, \", \",E262,\" x \",F262)","v":"T 281 x 12, 150.5 x 12"},281,12,{"$f":"C262/2+10","v":{"v":150.5,"d":"151"}},{"$f":"D262","v":12},3372,{"$f":"C262*SQRT(360)/(D262-1)","v":{"v":484.6909213676261,"d":"484.7"}},{"$f":"C262","v":281},{"$f":"D262","v":12},{"$f":"E262","v":150.5},{"$f":"F262","v":12},{"$f":"I262*J262+K262*L262","v":5178},{"v":0.003119006567349203,"d":"0%"},{"v":1022652.6666666665,"d":"1,022,653"}]
["L","L  250*16.0*90*16.0",250,16,90,16,4000,{"$f":"C263*SQRT(360)/D263","v":{"v":296.46353064078556,"d":"296.5"}},234,16,90,16,5184,{"v":1.1587485515642815E-3,"d":"0%"},{"v":735696,"d":"735,696"}]
["flat","F 260 x 19",260,20,{"v":259.6396394664564,"d":"260"},{"$f":"C264*D264","v":5200},5200,{"$f":"C264*SQRT(360)/(D264-1)","v":{"v":259.6396394664564,"d":"259.6"}},{"$f":"C264","v":260},{"$f":"D264","v":20},0,0,5200,{"v":3.0864197530864335E-3,"d":"0%"},{"v":675999.9999999999,"d":"676,000"}]
["HP","HP 300*13.0",300,13,56,null,3900,{"$f":"C265*SQRT(360)/D265","v":{"v":437.8538298694679,"d":"437.9"}},268.18,13,56,31.82,{"v":5268.26,"d":"5268"},{"v":0.013126923076923092,"d":"1%"},{"v":953881.3966,"d":"953,881"}]
["L","L  325*11.5*120*15.0",325,11.5,120,15,3737.5,{"$f":"C266*SQRT(360)/D266","v":{"v":536.2122988981165,"d":"536.2"}},313.5,11.5,120,15,{"v":5405.25,"d":"5405"},{"v":0.026002892795723875,"d":"3%"},{"v":1219789.3125,"d":"1,219,789"}]
["HP","HP 320*12.0",320,12,58,null,3840,{"$f":"C267*SQRT(360)/D267","v":{"v":505.96442562694074,"d":"506.0"}},285.96,12,58,34.04,{"v":5405.839999999999,"d":"5406"},{"v":1.0915313815251793E-4,"d":"0%"},{"v":1085084.7519999999,"d":"1,085,085"}]
["cropped_I","IPE 360 O _cropped",364,9.2,172,14.7,3348.7999999999997,{"$f":"C268*SQRT(360)/D268","v":{"v":750.6972184573632,"d":"750.7"}},313.6,9.2,172,14.7,{"v":5413.52,"d":"5414"},{"v":1.4206857768637171E-3,"d":"0%"},{"v":1335032.832,"d":"1,335,033"}]
["flat","F 260 x 20",260,21,{"v":246.6576574931336,"d":"247"},{"$f":"C269*D269","v":5460},5460,{"$f":"C269*SQRT(360)/(D269-1)","v":{"v":246.6576574931336,"d":"246.7"}},{"$f":"C269","v":260},{"$f":"D269","v":21},0,0,5460,{"v":0.008585910830660959,"d":"1%"},{"v":687266.6666666666,"d":"687,267"}]
["L","L  350*10.5*120*16.0",350,10.5,120,16,3675,{"$f":"C270*SQRT(360)/D270","v":{"v":632.4555320336758,"d":"632.5"}},339.5,10.5,120,16,{"v":5484.75,"d":"5485"},{"v":0.004532967032967017,"d":"0%"},{"v":1404667.1041666665,"d":"1,404,667"}]
["built_t",{"$f":"CONCATENATE(\"T \",C271,\" x \",D271, \", \",E271,\" x \",F271)","v":"T 300 x 12, 160 x 12"},300,12,{"$f":"C271/2+10","v":160},{"$f":"D271","v":12},3600,{"$f":"C271*SQRT(360)/(D271-1)","v":{"v":517.4636171184621,"d":"517.5"}},{"$f":"C271","v":300},{"$f":"D271","v":12},{"$f":"E271","v":160},{"$f":"F271","v":12},{"$f":"I271*J271+K271*L271","v":5520},{"v":6.426910980445788E-3,"d":"1%"},{"v":1164000,"d":"1,164,000"}]
["HP","HP 300*14.0",300,14,57,null,4200,{"$f":"C272*SQRT(360)/D272","v":{"v":406.5785563073631,"d":"406.6"}},268.18,14,57,31.82,{"v":5568.26,"d":"5568"},{"v":0.008742753623188548,"d":"1%"},{"v":971557.1404,"d":"971,557"}]
["built_t",{"$f":"CONCATENATE(\"T \",C273,\" x \",D273, \", \",E273,\" x \",F273)","v":"T 260 x 14, 140 x 14"},260,14,{"$f":"C273/2+10","v":140},{"$f":"D273","v":14},3640,{"$f":"C273*SQRT(360)/(D273-1)","v":{"v":379.47331922020555,"d":"379.5"}},{"$f":"C273","v":260},{"$f":"D273","v":14},{"$f":"E273","v":140},{"$f":"F273","v":14},{"$f":"I273*J273+K273*L273","v":5600},{"v":0.005700164862991297,"d":"1%"},{"v":948133.3333333333,"d":"948,133"}]
["flat","F 260 x 21",280,20,{"v":279.6119194254146,"d":"280"},{"$f":"C274*D274","v":5600},5600,{"$f":"C274*SQRT(360)/(D274-1)","v":{"v":279.6119194254146,"d":"279.6"}},{"$f":"C274","v":280},{"$f":"D274","v":20},0,0,5600,{"v":0,"d":"0%"},{"v":784000,"d":"784,000"}]
["half_I","IPE 450 O _half",456,11,192,17.6,5016,{"$f":"C275*SQRT(360)/D275","v":{"v":786.5446980200624,"d":"786.5"}},210.4,11,192,17.6,{"v":5693.6,"d":"5694"},{"v":0.01671428571428568,"d":"2%"},{"v":850268.48,"d":"850,268"}]
["flat","F 280 x 19",260,22,{"v":234.91205475536535,"d":"235"},{"$f":"C276*D276","v":5720},5720,{"$f":"C276*SQRT(360)/(D276-1)","v":{"v":234.91205475536532,"d":"234.9"}},{"$f":"C276","v":260},{"$f":"D276","v":22},0,0,5720,{"v":0.004636785162287493,"d":"0%"},{"v":698533.3333333333,"d":"698,533"}]
["HP","HP 320*13.0",320,13,59,null,4160,{"$f":"C277*SQRT(360)/D277","v":{"v":467.0440851940991,"d":"467.0"}},285.96,13,59,34.04,{"v":5725.839999999999,"d":"5726"},{"v":1.0209790209789738E-3,"d":"0%"},{"v":1105202.9911999998,"d":"1,105,203"}]
["cropped_I","IPE 360 R _cropped",366,9.9,168,16,3623.4,{"$f":"C278*SQRT(360)/D278","v":{"v":701.4506809828041,"d":"701.5"}},313,9.9,168,16,{"v":5786.700000000001,"d":"5787"},{"v":0.010629008145530028,"d":"1%"},{"$f":"1/6*I278*(4*K278*L278+J278*I278+40*I278)","v":{"v":1375671.5166666666,"d":"1,375,672"}}]
["HP","HP 340*12.0",340,12,61,null,4080,{"$f":"C279*SQRT(360)/D279","v":{"v":537.5872022286245,"d":"537.6"}},303.74,12,61,36.26,{"v":5856.74,"d":"5857"},{"v":0.012103616914648896,"d":"1%"},{"v":1247456.1301333334,"d":"1,247,456"}]
["HP","HP 300*15.0",300,15,58,null,4500,{"$f":"C280*SQRT(360)/D280","v":{"v":379.47331922020555,"d":"379.5"}},268.18,15,58,31.82,{"v":5868.26,"d":"5868"},{"v":1.9669645570745686E-3,"d":"0%"},{"v":989232.8842,"d":"989,233"}]
["half_I","IPE 450 R _half",458,11.3,188,18.6,5175.400000000001,{"$f":"C281*SQRT(360)/D281","v":{"v":769.0211513400625,"d":"769.0"}},210.4,11.3,188,18.6,{"v":5874.320000000001,"d":"5874"},{"v":1.0326740805621792E-3,"d":"0%"},{"v":868977.2479999999,"d":"868,977"}]
["built_t",{"$f":"CONCATENATE(\"T \",C282,\" x \",D282, \", \",E282,\" x \",F282)","v":"T 320 x 12, 170 x 12"},320,12,{"$f":"C282/2+10","v":170},{"$f":"D282","v":12},3840,{"$f":"C282*SQRT(360)/(D282-1)","v":{"v":551.9611915930262,"d":"552.0"}},{"$f":"C282","v":320},{"$f":"D282","v":12},{"$f":"E282","v":170},{"$f":"F282","v":12},{"$f":"I282*J282+K282*L282","v":5880},{"v":9.6692042653434562E-4,"d":"0%"},{"v":1322666.6666666665,"d":"1,322,667"}]
["flat","F 280 x 20",280,21,{"v":265.63132345414385,"d":"266"},{"$f":"C283*D283","v":5880},5880,{"$f":"C283*SQRT(360)/(D283-1)","v":{"v":265.63132345414385,"d":"265.6"}},{"$f":"C283","v":280},{"$f":"D283","v":21},0,0,5880,{"v":0,"d":"0%"},{"v":797066.6666666666,"d":"797,067"}]
["L","L 200 x 150 x 18",200,18,150,18,3600,{"$f":"C284*SQRT(360)/D284","v":{"v":210.81851067789196,"d":"210.8"}},182,18,150,18,5976,{"v":0.01632653061224487,"d":"2%"},{"v":647798.6666666666,"d":"647,799"}]
["L","L  375*10.5*120*18.0",375,10.5,120,18,3937.5,{"$f":"C285*SQRT(360)/D285","v":{"v":677.6309271789385,"d":"677.6"}},364.5,10.5,120,18,{"v":5987.25,"d":"5987"},{"v":1.8825301204818956E-3,"d":"0%"},{"v":1643120.4375,"d":"1,643,120"}]
["built_t",{"$f":"CONCATENATE(\"T \",C286,\" x \",D286, \", \",E286,\" x \",F286)","v":"T 280 x 14, 150 x 14"},280,14,{"$f":"C286/2+10","v":150},{"$f":"D286","v":14},3920,{"$f":"C286*SQRT(360)/(D286-1)","v":{"v":408.6635745448367,"d":"408.7"}},{"$f":"C286","v":280},{"$f":"D286","v":14},{"$f":"E286","v":150},{"$f":"F286","v":14},{"$f":"I286*J286+K286*L286","v":6020},{"v":0.005469956991941194,"d":"1%"},{"v":1097600,"d":"1,097,600"}]
["HP","HP 320*14.0",320,14,60,null,4480,{"$f":"C287*SQRT(360)/D287","v":{"v":433.68379339452065,"d":"433.7"}},285.96,14,60,34.04,{"v":6045.839999999999,"d":"6046"},{"v":0.004292358803986485,"d":"0%"},{"v":1125321.2303999998,"d":"1,125,321"}]
["L","L  350*11.5*120*18.0",350,11.5,120,18,4025,{"$f":"C288*SQRT(360)/D288","v":{"v":577.4593988133562,"d":"577.5"}},338.5,11.5,120,18,{"v":6052.75,"d":"6053"},{"v":1.1429346459714829E-3,"d":"0%"},{"v":1470937.6458333333,"d":"1,470,938"}]
["flat","F 280 x 21",280,22,{"v":252.98221281347037,"d":"253"},{"$f":"C289*D289","v":6160},6160,{"$f":"C289*SQRT(360)/(D289-1)","v":{"v":252.98221281347037,"d":"253.0"}},{"$f":"C289","v":280},{"$f":"D289","v":22},0,0,6160,{"v":0.017719218537028514,"d":"2%"},{"v":810133.3333333333,"d":"810,133"}]
["HP","HP 340*13.0",340,13,62,null,4420,{"$f":"C290*SQRT(360)/D290","v":{"v":496.2343405187303,"d":"496.2"}},303.74,13,62,36.26,{"v":6196.74,"d":"6197"},{"v":0.005964285714285644,"d":"1%"},{"v":1270174.8696666665,"d":"1,270,175"}]
["cropped_I","IPE 400 O _cropped",404,9.7,182,15.5,3918.7999999999997,{"$f":"C291*SQRT(360)/D291","v":{"v":790.243407035892,"d":"790.2"}},352,9.7,182,15.5,{"v":6235.4,"d":"6235"},{"v":0.006238764253462259,"d":"1%"},{"v":1688332.8,"d":"1,688,333"}]
["HP","HP 320*15.0",320,15,61,null,4800,{"$f":"C292*SQRT(360)/D292","v":{"v":404.7715405015526,"d":"404.8"}},285.96,15,61,34.04,{"v":6365.84,"d":"6366"},{"v":0.020919267408666675,"d":"2%"},{"v":1145439.4695999997,"d":"1,145,439"}]
["built_t",{"$f":"CONCATENATE(\"T \",C293,\" x \",D293, \", \",E293,\" x \",F293)","v":"T 260 x 16, 140 x 16"},260,16,{"$f":"C293/2+10","v":140},{"$f":"D293","v":16},4160,{"$f":"C293*SQRT(360)/(D293-1)","v":{"v":328.87687665751145,"d":"328.9"}},{"$f":"C293","v":260},{"$f":"D293","v":16},{"$f":"E293","v":140},{"$f":"F293","v":16},{"$f":"I293*J293+K293*L293","v":6400},{"v":5.366141781760092E-3,"d":"1%"},{"v":1019199.9999999999,"d":"1,019,200"}]
["half_I","IPE 450 V _half",460,12.4,194,19.6,5704,{"$f":"C294*SQRT(360)/D294","v":{"v":703.8618017794134,"d":"703.9"}},210.4,12.4,194,19.6,{"v":6411.360000000001,"d":"6411"},{"v":0.001775000000000082,"d":"0%"},{"v":919958.5706666666,"d":"919,959"}]
["built_t",{"$f":"CONCATENATE(\"T \",C295,\" x \",D295, \", \",E295,\" x \",F295)","v":"T 300 x 14, 160 x 14"},300,14,{"$f":"C295/2+10","v":160},{"$f":"D295","v":14},4200,{"$f":"C295*SQRT(360)/(D295-1)","v":{"v":437.8538298694679,"d":"437.9"}},{"$f":"C295","v":300},{"$f":"D295","v":14},{"$f":"E295","v":160},{"$f":"F295","v":14},{"$f":"I295*J295+K295*L295","v":6440},{"v":0.004467070949065288,"d":"0%"},{"v":1258000,"d":"1,258,000"}]
["flat","F 280 x 22",280,23,{"v":241.48302132194897,"d":"241"},{"$f":"C296*D296","v":6440},6440,{"$f":"C296*SQRT(360)/(D296-1)","v":{"v":241.48302132194897,"d":"241.5"}},{"$f":"C296","v":280},{"$f":"D296","v":23},0,0,6440,{"v":0,"d":"0%"},{"v":823200,"d":"823,200"}]
["HP","HP 340*14.0",340,14,63,null,4760,{"$f":"C297*SQRT(360)/D297","v":{"v":460.78903048167814,"d":"460.8"}},303.74,14,63,36.26,{"v":6536.74,"d":"6537"},{"v":0.015021739130434808,"d":"2%"},{"v":1292893.6092,"d":"1,292,894"}]
["L","L  375*11.5*120*20.0",375,11.5,120,20,4312.5,{"$f":"C298*SQRT(360)/D298","v":{"v":618.706498728596,"d":"618.7"}},363.5,11.5,120,20,{"v":6580.25,"d":"6580"},{"v":0.006656223132631922,"d":"1%"},{"v":1715735.1458333333,"d":"1,715,735"}]
["flat","F 300 x 21",300,22,{"v":271.05237087157536,"d":"271"},{"$f":"C299*D299","v":6600},6600,{"$f":"C299*SQRT(360)/(D299-1)","v":{"v":271.05237087157536,"d":"271.1"}},{"$f":"C299","v":300},{"$f":"D299","v":22},0,0,6600,{"v":3.001405721667183E-3,"d":"0%"},{"v":930000,"d":"930,000"}]
["half_I","IPE 500 O _half",506,12,202,19,6072,{"$f":"C300*SQRT(360)/D300","v":{"v":800.0562480226,"d":"800.1"}},234,12,202,19,6646,{"v":0.00696969696969707,"d":"1%"},{"v":1073280,"d":"1,073,280"}]
["HP","HP 320*16.0",320,16,62,null,5120,{"$f":"C301*SQRT(360)/D301","v":{"v":379.47331922020555,"d":"379.5"}},285.96,16,62,34.04,{"v":6685.84,"d":"6686"},{"v":0.005994583207944659,"d":"1%"},{"v":1165557.7088,"d":"1,165,558"}]
["cropped_I","IPE 400 R _cropped",407,10.6,178,17,4314.2,{"$f":"C302*SQRT(360)/D302","v":{"v":728.517174163319,"d":"728.5"}},352,10.6,178,17,{"v":6757.2,"d":"6757"},{"v":0.010673303578907056,"d":"1%"},{"v":1755025.0666666667,"d":"1,755,025"}]
["built_t",{"$f":"CONCATENATE(\"T \",C303,\" x \",D303, \", \",E303,\" x \",F303)","v":"T 320 x 14, 170 x 14"},320,14,{"$f":"C303/2+10","v":170},{"$f":"D303","v":14},4480,{"$f":"C303*SQRT(360)/(D303-1)","v":{"v":467.0440851940991,"d":"467.0"}},{"$f":"C303","v":320},{"$f":"D303","v":14},{"$f":"E303","v":170},{"$f":"F303","v":14},{"$f":"I303*J303+K303*L303","v":6860},{"v":0.015213402000828768,"d":"2%"},{"v":1429333.3333333333,"d":"1,429,333"}]
["HP","HP 340*15.0",340,15,64,null,5100,{"$f":"C304*SQRT(360)/D304","v":{"v":430.06976178289955,"d":"430.1"}},303.74,15,64,36.26,{"v":6876.74,"d":"6877"},{"v":0.002440233236151501,"d":"0%"},{"v":1315612.3487333334,"d":"1,315,612"}]
["built_t",{"$f":"CONCATENATE(\"T \",C305,\" x \",D305, \", \",E305,\" x \",F305)","v":"T 280 x 16, 150 x 16"},280,16,{"$f":"C305/2+10","v":150},{"$f":"D305","v":16},4480,{"$f":"C305*SQRT(360)/(D305-1)","v":{"v":354.1750979388585,"d":"354.2"}},{"$f":"C305","v":280},{"$f":"D305","v":16},{"$f":"E305","v":150},{"$f":"F305","v":16},{"$f":"I305*J305+K305*L305","v":6880},{"v":4.740618374403649E-4,"d":"0%"},{"v":1179733.3333333333,"d":"1,179,733"}]
["flat","F 300 x 22",300,23,{"v":258.73180855923107,"d":"259"},{"$f":"C306*D306","v":6900},6900,{"$f":"C306*SQRT(360)/(D306-1)","v":{"v":258.73180855923107,"d":"258.7"}},{"$f":"C306","v":300},{"$f":"D306","v":23},0,0,6900,{"v":2.9069767441860517E-3,"d":"0%"},{"v":945000,"d":"945,000"}]
["half_I","IPE 500 R _half",508,12.6,198,20,6400.8,{"$f":"C307*SQRT(360)/D307","v":{"v":764.9700244597794,"d":"765.0"}},234,12.6,198,20,{"v":6908.4,"d":"6908"},{"v":1.2173913043478368E-3,"d":"0%"},{"v":1097787.6,"d":"1,097,788"}]
["cropped_I","IPE 400 V _cropped",408,10.6,182,17.5,4324.8,{"$f":"C308*SQRT(360)/D308","v":{"v":730.3071426502069,"d":"730.3"}},352,10.6,182,17.5,{"v":6916.2,"d":"6916"},{"v":1.129060274448479E-3,"d":"0%"},{"v":1792337.0666666667,"d":"1,792,337"}]
["HP","HP 370*13.0",370,13,66.5,null,4810,{"$f":"C309*SQRT(360)/D309","v":{"v":540.0197235056771,"d":"540.0"}},330.41,13,66.5,39.589999999999996,{"v":6928.065,"d":"6928"},{"v":1.7155374338508889E-3,"d":"0%"},{"v":1544263.0991166667,"d":"1,544,263"}]
["flat","F 300 x 23",300,24,{"v":247.48259949143838,"d":"247"},{"$f":"C310*D310","v":7200},7200,{"$f":"C310*SQRT(360)/(D310-1)","v":{"v":247.4825994914384,"d":"247.5"}},{"$f":"C310","v":300},{"$f":"D310","v":24},0,0,7200,{"v":0.03925121949635302,"d":"4%"},{"v":960000,"d":"960,000"}]
["HP","HP 340*16.0",340,16,65,null,5440,{"$f":"C311*SQRT(360)/D311","v":{"v":403.19040167146835,"d":"403.2"}},303.74,16,65,36.26,{"v":7216.74,"d":"7217"},{"v":2.3249999999999105E-3,"d":"0%"},{"v":1338331.0882666667,"d":"1,338,331"}]
["L","L  400*11.5*120*23.0",400,11.5,120,23,4600,{"$f":"C312*SQRT(360)/D312","v":{"v":659.9535986438357,"d":"660.0"}},388.5,11.5,120,23,{"v":7227.75,"d":"7228"},{"v":1.525619601094208E-3,"d":"0%"},{"v":2010341.8125,"d":"2,010,342"}]
["built_t",{"$f":"CONCATENATE(\"T \",C313,\" x \",D313, \", \",E313,\" x \",F313)","v":"T 340 x 14, 180 x 14"},340,14,{"$f":"C313/2+10","v":180},{"$f":"D313","v":14},4760,{"$f":"C313*SQRT(360)/(D313-1)","v":{"v":496.2343405187303,"d":"496.2"}},{"$f":"C313","v":340},{"$f":"D313","v":14},{"$f":"E313","v":180},{"$f":"F313","v":14},{"$f":"I313*J313+K313*L313","v":7280},{"v":7.229082356196681E-3,"d":"1%"},{"v":1611600,"d":"1,611,600"}]
["HP","HP 370*14.0",370,14,67.5,null,5180,{"$f":"C314*SQRT(360)/D314","v":{"v":501.44688611241446,"d":"501.4"}},330.41,14,67.5,39.589999999999996,{"v":7298.0650000000005,"d":"7298"},{"v":2.4814560439561095E-3,"d":"0%"},{"v":1571178.8484000002,"d":"1,571,179"}]
["built_t",{"$f":"CONCATENATE(\"T \",C315,\" x \",D315, \", \",E315,\" x \",F315)","v":"T 300 x 16, 160 x 16"},300,16,{"$f":"C315/2+10","v":160},{"$f":"D315","v":16},4800,{"$f":"C315*SQRT(360)/(D315-1)","v":{"v":379.47331922020555,"d":"379.5"}},{"$f":"C315","v":300},{"$f":"D315","v":16},{"$f":"E315","v":160},{"$f":"F315","v":16},{"$f":"I315*J315+K315*L315","v":7360},{"v":0.00848649607806995,"d":"1%"},{"v":1352000,"d":"1,352,000"}]
["flat","F 300 x 24",320,23,{"v":275.9805957965131,"d":"276"},{"$f":"C316*D316","v":7360},7360,{"$f":"C316*SQRT(360)/(D316-1)","v":{"v":275.9805957965131,"d":"276.0"}},{"$f":"C316","v":320},{"$f":"D316","v":23},0,0,7360,{"v":0,"d":"0%"},{"v":1075200,"d":"1,075,200"}]
["flat","F 320 x 22",300,25,{"v":237.17082451262846,"d":"237"},{"$f":"C317*D317","v":7500},7500,{"$f":"C317*SQRT(360)/(D317-1)","v":{"v":237.17082451262846,"d":"237.2"}},{"$f":"C317","v":300},{"$f":"D317","v":25},0,0,7500,{"v":0.01902173913043481,"d":"2%"},{"v":975000,"d":"975,000"}]
["L","L  425*11.5*120*24.0",425,11.5,120,24,4887.5,{"$f":"C318*SQRT(360)/D318","v":{"v":701.2006985590754,"d":"701.2"}},413.5,11.5,120,24,{"v":7635.25,"d":"7635"},{"v":0.018033333333333346,"d":"2%"},{"v":2261517.645833333,"d":"2,261,518"}]
["HP","HP 370*15.0",370,15,68.5,null,5550,{"$f":"C319*SQRT(360)/D319","v":{"v":468.0170937049201,"d":"468.0"}},330.41,15,68.5,39.589999999999996,{"v":7668.0650000000005,"d":"7668"},{"v":0.004297829147703158,"d":"0%"},{"v":1598094.5976833336,"d":"1,598,095"}]
["flat","F 320 x 23",320,24,{"v":263.9814394575343,"d":"264"},{"$f":"C320*D320","v":7680},7680,{"$f":"C320*SQRT(360)/(D320-1)","v":{"v":263.9814394575343,"d":"264.0"}},{"$f":"C320","v":320},{"$f":"D320","v":24},0,0,7680,{"v":1.5564552465321402E-3,"d":"0%"},{"v":1092266.6666666665,"d":"1,092,267"}]
["built_t",{"$f":"CONCATENATE(\"T \",C321,\" x \",D321, \", \",E321,\" x \",F321)","v":"T 360 x 14, 190 x 14"},360,14,{"$f":"C321/2+10","v":190},{"$f":"D321","v":14},5040,{"$f":"C321*SQRT(360)/(D321-1)","v":{"v":525.4245958433614,"d":"525.4"}},{"$f":"C321","v":360},{"$f":"D321","v":14},{"$f":"E321","v":190},{"$f":"F321","v":14},{"$f":"I321*J321+K321*L321","v":7700},{"v":2.6041666666667407E-3,"d":"0%"},{"v":1804800,"d":"1,804,800"}]
["cropped_I","IPE 450 O _cropped",456,11,192,17.6,5016,{"$f":"C322*SQRT(360)/D322","v":{"v":786.5446980200624,"d":"786.5"}},399.79999999999995,11,192,17.6,7777,{"v":0.010000000000000009,"d":"1%"},{"v":2259309.78,"d":"2,259,310"}]
["built_t",{"$f":"CONCATENATE(\"T \",C323,\" x \",D323, \", \",E323,\" x \",F323)","v":"T 320 x 16, 170 x 16"},320,16,{"$f":"C323/2+10","v":170},{"$f":"D323","v":16},5120,{"$f":"C323*SQRT(360)/(D323-1)","v":{"v":404.7715405015526,"d":"404.8"}},{"$f":"C323","v":320},{"$f":"D323","v":16},{"$f":"E323","v":170},{"$f":"F323","v":16},{"$f":"I323*J323+K323*L323","v":7840},{"v":0.008100810081008047,"d":"1%"},{"v":1535999.9999999998,"d":"1,536,000"}]
["L","L  400*12.5*120*25.0",400,12.5,120,25,5000,{"$f":"C324*SQRT(360)/D324","v":{"v":607.1573107523288,"d":"607.2"}},387.5,12.5,120,25,{"v":7843.75,"d":"7844"},{"$f":"M324/M323-1","v":{"v":4.7831632653050349E-4,"d":"0%"}},{"v":2088867.1874999998,"d":"2,088,867"}]
["flat","F 320 x 24",320,25,{"v":252.98221281347037,"d":"253"},{"$f":"C325*D325","v":8000},{"$f":"C325*D325","v":8000},{"$f":"C325*SQRT(360)/(D325-1)","v":{"v":252.98221281347037,"d":"253.0"}},{"$f":"C325","v":320},{"$f":"D325","v":25},0,0,8000,{"v":0.019920318725099584,"d":"2%"},{"v":1109333.3333333333,"d":"1,109,333"}]
["cropped_I","IPE 450 R _cropped",458,11.3,188,18.6,5175.400000000001,{"$f":"C326*SQRT(360)/D326","v":{"v":769.0211513400625,"d":"769.0"}},399.79999999999995,11.3,188,18.6,{"v":8014.54,"d":"8015"},{"v":1.8175000000000274E-3,"d":"0%"},{"v":2298646.102,"d":"2,298,646"}]
["half_I","IPE 500 V _half",514,14.2,204,23,7298.799999999999,{"$f":"C327*SQRT(360)/D327","v":{"v":686.7932608422029,"d":"686.8"}},234,14.2,204,23,{"v":8014.799999999999,"d":"8015"},{"v":3.2441038412489576E-5,"d":"0%"},{"v":1226581.2,"d":"1,226,581"}]
["HP","HP 370*16.0",370,16,69.5,null,5920,{"$f":"C328*SQRT(360)/D328","v":{"v":438.76602534836263,"d":"438.8"}},330.41,16,69.5,39.589999999999996,{"v":8038.0650000000005,"d":"8038"},{"v":0.002902754903428839,"d":"0%"},{"v":1625010.3469666666,"d":"1,625,010"}]
["L","L  450*11.5*120*25.0",450,11.5,120,25,5175,{"$f":"C329*SQRT(360)/D329","v":{"v":742.4477984743152,"d":"742.4"}},438.5,11.5,120,25,{"v":8042.75,"d":"8043"},{"v":0.000582851718666122,"d":"0%"},{"v":2527422.645833333,"d":"2,527,423"}]
["HP","HP 400*14.0",400,14,72,null,5600,{"$f":"C330*SQRT(360)/D330","v":{"v":542.1047417431507,"d":"542.1"}},357.08,14,72,42.92,{"v":8089.360000000001,"d":"8089"},{"v":0.005795281464673119,"d":"1%"},{"v":1883197.0703999999,"d":"1,883,197"}]
["built_t",{"$f":"CONCATENATE(\"T \",C331,\" x \",D331, \", \",E331,\" x \",F331)","v":"T 380 x 14, 200 x 14"},380,14,{"$f":"C331/2+10","v":200},{"$f":"D331","v":14},5320,{"$f":"C331*SQRT(360)/(D331-1)","v":{"v":554.6148511679927,"d":"554.6"}},{"$f":"C331","v":380},{"$f":"D331","v":14},{"$f":"E331","v":200},{"$f":"F331","v":14},{"$f":"I331*J331+K331*L331","v":8120},{"v":0.003787691486100142,"d":"0%"},{"v":2008933.3333333333,"d":"2,008,933"}]
["flat","F 320 x 26",340,24,{"v":268.79360111431225,"d":"269"},{"$f":"C332*D332","v":8160},8160,{"$f":"C332*SQRT(360)/(D332-1)","v":{"v":280.4802794236302,"d":"280.5"}},{"$f":"C332","v":340},{"$f":"D332","v":24},0,0,8160,{"v":4.9261083743843415E-3,"d":"0%"},{"v":1233066.6666666665,"d":"1,233,067"}]
["half_I","IPE 550 R _half",560,14,210,22.2,7840,{"$f":"C333*SQRT(360)/D333","v":{"v":758.9466384404111,"d":"758.9"}},257.8,14,210,22.2,{"v":8271.2,"d":"8271"},{"v":0.013627450980392197,"d":"1%"},{"v":1399389.9600000002,"d":"1,399,390"}]
["L","L  425*12.5*120*26.0",425,12.5,120,26,5312.5,{"$f":"C334*SQRT(360)/D334","v":{"v":645.1046426743494,"d":"645.1"}},412.5,12.5,120,26,{"v":8276.25,"d":"8276"},{"v":6.1055227778306076E-4,"d":"0%"},{"v":2346867.1875,"d":"2,346,867"}]
["built_t",{"$f":"CONCATENATE(\"T \",C335,\" x \",D335, \", \",E335,\" x \",F335)","v":"T 300 x 18, 160 x 18"},300,18,{"$f":"C335/2+10","v":160},{"$f":"D335","v":18},5400,{"$f":"C335*SQRT(360)/(D335-1)","v":{"v":334.8293993119461,"d":"334.8"}},{"$f":"C335","v":300},18,160,18,{"$f":"I335*J335+K335*L335","v":8280},{"v":0.000453103760761131,"d":"0%"},{"v":1446000,"d":"1,446,000"}]
["built_t",{"$f":"CONCATENATE(\"T \",C336,\" x \",D336, \", \",E336,\" x \",F336)","v":"T 340 x 16, 180 x 16"},340,16,{"$f":"C336/2+10","v":180},{"$f":"D336","v":16},5440,{"$f":"C336*SQRT(360)/(D336-1)","v":{"v":430.06976178289955,"d":"430.1"}},340,16,180,16,{"$f":"I336*J336+K336*L336","v":8320},{"v":0.004830917874396157,"d":"0%"},{"v":1731733.3333333333,"d":"1,731,733"}]
["flat","F 320 x 25",320,26,{"v":242.86292430093155,"d":"243"},{"$f":"C337*D337","v":8320},8320,{"$f":"C337*SQRT(360)/(D337-1)","v":{"v":242.86292430093155,"d":"242.9"}},{"$f":"C337","v":320},{"$f":"D337","v":26},0,0,8320,{"v":0,"d":"0%"},{"v":1126400,"d":"1,126,400"}]
["HP","HP 370*17.0",370,17,70.5,null,6290,{"$f":"C338*SQRT(360)/D338","v":{"v":412.9562591514001,"d":"413.0"}},330.41,17,70.5,39.589999999999996,{"v":8408.065,"d":"8408"},{"v":0.010584735576923077,"d":"1%"},{"v":1651926.09625,"d":"1,651,926"}]
["HP","HP 400*15.0",400,15,73,null,6000,{"$f":"C339*SQRT(360)/D339","v":{"v":505.9644256269407,"d":"506.0"}},357.08,15,73,42.92,{"v":8489.36,"d":"8489"},{"v":0.009668693094071035,"d":"1%"},{"v":1914665.3405333331,"d":"1,914,665"}]
["flat","F 340 x 25",340,25,{"v":258.04185706973976,"d":"258"},{"$f":"C340*D340","v":8500},8500,{"$f":"C340*SQRT(360)/(D340-1)","v":{"v":268.79360111431225,"d":"268.8"}},{"$f":"C340","v":340},{"$f":"D340","v":25},0,0,8500,{"v":1.2533335846283133E-3,"d":"0%"},{"v":1252333.3333333333,"d":"1,252,333"}]
["flat","F 340 x 24",320,27,{"v":233.52204259704956,"d":"234"},{"$f":"C341*D341","v":8640},8640,{"$f":"C341*SQRT(360)/(D341-1)","v":{"v":233.52204259704956,"d":"233.5"}},{"$f":"C341","v":320},{"$f":"D341","v":27},0,0,8640,{"v":0.016470588235294015,"d":"2%"},{"v":1143466.6666666665,"d":"1,143,467"}]
["L","L  475*11.5*120*28.0",475,11.5,120,28,5462.5,{"$f":"C342*SQRT(360)/D342","v":{"v":783.6948983895549,"d":"783.7"}},463.5,11.5,120,28,{"v":8690.25,"d":"8690"},{"v":0.005815972222222188,"d":"1%"},{"$f":"1/6*I342*(4*K342*L342+J342*I342+40*I342)","v":{"v":2882216.8125,"d":"2,882,217"}}]
["L","L  450*12.5*120*27.0",450,12.5,120,27,5625,{"$f":"C343*SQRT(360)/D343","v":{"v":683.05197459637,"d":"683.1"}},437.5,12.5,120,27,{"v":8708.75,"d":"8709"},{"v":0.002128822530997443,"d":"0%"},{"v":2619804.6874999995,"d":"2,619,805"}]
["cropped_I","IPE 450 V _cropped",460,12.4,194,19.6,5704,{"$f":"C344*SQRT(360)/D344","v":{"v":703.8618017794134,"d":"703.9"}},399.79999999999995,12.4,194,19.6,{"v":8759.92,"d":"8760"},{"v":0.005875699727285744,"d":"1%"},{"v":2409402.6959999995,"d":"2,409,403"}]
["HP","HP 370*18.0",370,18,71.5,null,6660,{"$f":"C345*SQRT(360)/D345","v":{"v":390.0142447541001,"d":"390.0"}},330.41,18,71.5,39.589999999999996,{"v":8778.065,"d":"8778"},{"v":2.071365948547621E-3,"d":"0%"},{"v":1678841.8455333335,"d":"1,678,842"}]
["built_t",{"$f":"CONCATENATE(\"T \",C346,\" x \",D346, \", \",E346,\" x \",F346)","v":"T 360 x 16, 190 x 16"},360,16,{"$f":"C346/2+10","v":190},{"$f":"D346","v":16},5760,{"$f":"C346*SQRT(360)/(D346-1)","v":{"v":455.36798306424663,"d":"455.4"}},{"$f":"C346","v":360},16,190,16,{"$f":"I346*J346+K346*L346","v":8800},{"v":2.4988422847176395E-3,"d":"0%"},{"v":1939200,"d":"1,939,200"}]
["built_t",{"$f":"CONCATENATE(\"T \",C347,\" x \",D347, \", \",E347,\" x \",F347)","v":"T 320 x 18, 170 x 18"},320,18,{"$f":"C347/2+10","v":170},{"$f":"D347","v":18},5760,{"$f":"C347*SQRT(360)/(D347-1)","v":{"v":357.1513592660758,"d":"357.2"}},320,18,170,18,{"$f":"I347*J347+K347*L347","v":8820},{"v":0.002272727272727204,"d":"0%"},{"v":1642666.6666666665,"d":"1,642,667"}]
["flat","F 360 x 24",340,26,{"v":248.11717025936514,"d":"248"},{"$f":"C348*D348","v":8840},8840,{"$f":"C348*SQRT(360)/(D348-1)","v":{"v":258.04185706973976,"d":"258.0"}},{"$f":"C348","v":340},{"$f":"D348","v":26},0,0,8840,{"v":2.2675736961450532E-3,"d":"0%"},{"v":1271600,"d":"1,271,600"}]
["HP","HP 400*16.0",400,16,74,null,6400,{"$f":"C349*SQRT(360)/D349","v":{"v":474.3416490252569,"d":"474.3"}},357.08,16,74,42.92,{"v":8889.36,"d":"8889"},{"v":0.005583710407239817,"d":"1%"},{"v":1946133.6106666662,"d":"1,946,134"}]
["cropped_I","IPE 500 O _cropped",506,12,202,19,6072,{"$f":"C350*SQRT(360)/D350","v":{"v":800.0562480226,"d":"800.1"}},444,12,202,19,9166,{"v":0.031120350621417048,"d":"3%"},{"v":2844560,"d":"2,844,560"}]
["flat","F 340 x 26",340,27,{"v":238.92764543494422,"d":"239"},{"$f":"C351*D351","v":9180},9180,{"$f":"C351*SQRT(360)/(D351-1)","v":{"v":248.11717025936514,"d":"248.1"}},{"$f":"C351","v":340},{"$f":"D351","v":27},0,0,9180,{"v":1.5273838097316084E-3,"d":"0%"},{"v":1290866.6666666665,"d":"1,290,867"}]
["built_t",{"$f":"CONCATENATE(\"T \",C352,\" x \",D352, \", \",E352,\" x \",F352)","v":"T 380 x 16, 200 x 16"},380,16,{"$f":"MIN(C352/2+10,200)","v":200},{"$f":"D352","v":16},6080,{"$f":"C352*SQRT(360)/(D352-1)","v":{"v":480.66620434559366,"d":"480.7"}},{"$f":"C352","v":380},{"$f":"D352","v":16},{"$f":"E352","v":200},{"$f":"F352","v":16},{"$f":"I352*J352+K352*L352","v":9280},{"v":0.01089324618736387,"d":"1%"},{"v":2158400,"d":"2,158,400"}]
["HP","HP 400*17.0",400,17,75,null,6800,{"$f":"C353*SQRT(360)/D353","v":{"v":446.43919908259477,"d":"446.4"}},357.08,17,75,42.92,{"v":9289.36,"d":"9289"},{"v":1.0086206896551264E-3,"d":"0%"},{"v":1977601.8807999997,"d":"1,977,602"}]
["HP","HP 430*15.0",430,15,77.5,null,6450,{"$f":"C354*SQRT(360)/D354","v":{"v":543.9117575489613,"d":"543.9"}},383.75,15,77.5,46.25,{"v":9340.625,"d":"9341"},{"v":5.518679435396967E-3,"d":"1%"},{"v":2266923.177083333,"d":"2,266,923"}]
["built_t",{"$f":"CONCATENATE(\"T \",C355,\" x \",D355, \", \",E355,\" x \",F355)","v":"T 340 x 18, 180 x 18"},340,18,{"$f":"MIN(C355/2+10,200)","v":180},{"$f":"D355","v":18},6120,{"$f":"C355*SQRT(360)/(D355-1)","v":{"v":379.4733192202055,"d":"379.5"}},{"$f":"C355","v":340},{"$f":"D355","v":18},{"$f":"E355","v":180},{"$f":"F355","v":18},{"$f":"I355*J355+K355*L355","v":9360},{"v":0.00207427233188362,"d":"0%"},{"v":1851866.6666666665,"d":"1,851,867"}]
["flat","F 360 x 25",360,26,{"v":284.60498941515414,"d":"285"},{"$f":"C356*D356","v":9360},9360,{"$f":"C356*SQRT(360)/(D356-1)","v":{"v":273.22078983854794,"d":"273.2"}},{"$f":"C356","v":360},{"$f":"D356","v":26},0,0,9360,{"v":0,"d":"0%"},{"v":1425600,"d":"1,425,600"}]
["L","L  475*12.5*120*30.0",475,12.5,120,30,5937.5,{"$f":"C357*SQRT(360)/D357","v":{"v":720.9993065183905,"d":"721.0"}},462.5,12.5,120,30,{"v":9381.25,"d":"9381"},{"v":2.2702991452991927E-3,"d":"0%"},{"v":2981679.6875,"d":"2,981,680"}]
["cropped_I","IPE 500 R _cropped",508,12.6,198,20,6400.8,{"$f":"C358*SQRT(360)/D358","v":{"v":764.9700244597794,"d":"765.0"}},444,12.6,198,20,{"v":9554.4,"d":"9554"},{"v":0.018457028647568263,"d":"2%"},{"v":2900385.6,"d":"2,900,386"}]
["half_I","IPE 600 O _half",610,15,224,24,9150,{"$f":"C359*SQRT(360)/D359","v":{"v":771.5957490810846,"d":"771.6"}},281,15,224,24,9591,{"v":3.8306958050742246E-3,"d":"0%"},{"v":1730913.1666666665,"d":"1,730,913"}]
["built_t",{"$f":"CONCATENATE(\"T \",C360,\" x \",D360, \", \",E360,\" x \",F360)","v":"T 400 x 16, 200 x 16"},400,16,{"$f":"MIN(C360/2+10,200)","v":200},{"$f":"D360","v":16},6400,{"$f":"C360*SQRT(360)/(D360-1)","v":{"v":505.9644256269407,"d":"506.0"}},{"$f":"C360","v":400},{"$f":"D360","v":16},{"$f":"E360","v":200},{"$f":"F360","v":16},{"$f":"I360*J360+K360*L360","v":9600},{"v":9.3837973099786254E-4,"d":"0%"},{"v":2346666.6666666665,"d":"2,346,667"}]
["HP","HP 400*18.0",400,18,76,null,7200,{"$f":"C361*SQRT(360)/D361","v":{"v":421.63702135578393,"d":"421.6"}},357.08,18,76,42.92,{"v":9689.36,"d":"9689"},{"v":0.009308333333333474,"d":"1%"},{"v":2009070.1509333332,"d":"2,009,070"}]
["flat","F 340 x 27",360,27,{"v":273.220789838548,"d":"273"},{"$f":"C362*D362","v":9720},9720,{"$f":"C362*SQRT(360)/(D362-1)","v":{"v":262.7122979216807,"d":"262.7"}},{"$f":"C362","v":360},{"$f":"D362","v":27},0,0,9720,{"v":3.1622315612176433E-3,"d":"0%"},{"v":1447200,"d":"1,447,200"}]
["HP","HP 430*16.0",430,16,78.5,null,6880,{"$f":"C363*SQRT(360)/D363","v":{"v":509.9172727021512,"d":"509.9"}},383.75,16,78.5,46.25,{"v":9770.625,"d":"9771"},{"v":0.005208333333333259,"d":"1%"},{"v":2303299.4791666665,"d":"2,303,299"}]
["built_t",{"$f":"CONCATENATE(\"T \",C364,\" x \",D364, \", \",E364,\" x \",F364)","v":"T 320 x 20, 170 x 20"},320,20,{"$f":"MIN(C364/2+10,200)","v":170},{"$f":"D364","v":20},6400,{"$f":"C364*SQRT(360)/(D364-1)","v":{"v":319.556479343331,"d":"319.6"}},{"$f":"C364","v":320},{"$f":"D364","v":20},{"$f":"E364","v":170},{"$f":"F364","v":20},{"$f":"I364*J364+K364*L364","v":9800},{"v":0.003006460692125623,"d":"0%"},{"v":1749333.3333333333,"d":"1,749,333"}]
["half_I","IPE 550 V _half",566,17.1,216,25.2,9678.6,{"$f":"C365*SQRT(360)/D365","v":{"v":628.0172475983518,"d":"628.0"}},257.8,17.1,216,25.2,{"v":9851.58,"d":"9852"},{"v":0.005263265306122422,"d":"1%"},{"v":1567990.3006666668,"d":"1,567,990"}]
["built_t",{"$f":"CONCATENATE(\"T \",C366,\" x \",D366, \", \",E366,\" x \",F366)","v":"T 360 x 18, 190 x 18"},360,18,{"$f":"MIN(C366/2+10,200)","v":190},{"$f":"D366","v":18},6480,{"$f":"C366*SQRT(360)/(D366-1)","v":{"v":401.79527917433523,"d":"401.8"}},{"$f":"C366","v":360},18,190,18,{"$f":"I366*J366+K366*L366","v":9900},{"v":0.00491494765306677,"d":"0%"},{"v":2073600,"d":"2,073,600"}]
["built_t",{"$f":"CONCATENATE(\"T \",C367,\" x \",D367, \", \",E367,\" x \",F367)","v":"T 420 x 16, 200 x 16"},420,16,{"$f":"MIN(C367/2+10,200)","v":200},{"$f":"D367","v":16},6720,{"$f":"C367*SQRT(360)/(D367-1)","v":{"v":531.2626469082877,"d":"531.3"}},420,16,200,16,{"$f":"I367*J367+K367*L367","v":9920},{"v":0.002020202020202033,"d":"0%"},{"v":2542400,"d":"2,542,400"}]
["flat","F 360 x 26",360,28,{"v":262.7122979216808,"d":"263"},{"$f":"C368*D368","v":10080},10080,{"$f":"C368*SQRT(360)/(D368-1)","v":{"v":252.98221281347034,"d":"253.0"}},{"$f":"C368","v":360},{"$f":"D368","v":28},0,0,10080,{"v":0.016129032258064502,"d":"2%"},{"v":1468800,"d":"1,468,800"}]
["HP","HP 400*19.0",400,19,77,null,7600,{"$f":"C369*SQRT(360)/D369","v":{"v":399.4455991791637,"d":"399.4"}},357.08,19,77,42.92,{"v":10089.36,"d":"10089"},{"v":9.2857142857138975E-4,"d":"0%"},{"v":2040538.4210666665,"d":"2,040,538"}]
["HP","HP 430*17.0",430,17,79.5,null,7310,{"$f":"C370*SQRT(360)/D370","v":{"v":479.9221390137894,"d":"479.9"}},383.75,17,79.5,46.25,{"v":10200.625,"d":"10201"},{"v":0.011027954201257462,"d":"1%"},{"v":2339675.78125,"d":"2,339,676"}]
["built_t",{"$f":"CONCATENATE(\"T \",C371,\" x \",D371, \", \",E371,\" x \",F371)","v":"T 440 x 16, 200 x 16"},440,16,{"$f":"MIN(C371/2+10,200)","v":200},{"$f":"D371","v":16},7040,{"$f":"C371*SQRT(360)/(D371-1)","v":{"v":556.5608681896348,"d":"556.6"}},{"$f":"C371","v":440},{"$f":"D371","v":16},{"$f":"E371","v":200},{"$f":"F371","v":16},{"$f":"I371*J371+K371*L371","v":10240},{"v":3.8600575945102467E-3,"d":"0%"},{"v":2745600,"d":"2,745,600"}]
["flat","F 380 x 27",380,27,{"v":277.30742558399635,"d":"277"},{"$f":"C372*D372","v":10260},10260,{"$f":"C372*SQRT(360)/(D372-1)","v":{"v":277.30742558399635,"d":"277.3"}},{"$f":"C372","v":380},27,0,0,10260,{"v":1.953125E-3,"d":"0%"},{"v":1612466.6666666665,"d":"1,612,467"}]
["built_t",{"$f":"CONCATENATE(\"T \",C373,\" x \",D373, \", \",E373,\" x \",F373)","v":"T 340 x 20, 180 x 20"},340,20,{"$f":"MIN(C373/2+10,200)","v":180},{"$f":"D373","v":20},6800,{"$f":"C373*SQRT(360)/(D373-1)","v":{"v":339.52875930228913,"d":"339.5"}},340,20,{"$f":"E373","v":180},{"$f":"F373","v":20},{"$f":"I373*J373+K373*L373","v":10400},{"v":0.013645224171539905,"d":"1%"},{"v":1972000,"d":"1,972,000"}]
["built_t",{"$f":"CONCATENATE(\"T \",C374,\" x \",D374, \", \",E374,\" x \",F374)","v":"T 380 x 18, 200 x 18"},380,18,{"$f":"MIN(C374/2+10,200)","v":200},{"$f":"D374","v":18},6840,{"$f":"C374*SQRT(360)/(D374-1)","v":{"v":424.117239128465,"d":"424.1"}},380,18,{"$f":"E374","v":200},{"$f":"F374","v":18},{"$f":"I374*J374+K374*L374","v":10440},{"v":3.8461538461538325E-3,"d":"0%"},{"v":2307866.6666666665,"d":"2,307,867"}]
["flat","F 360 x 27",360,29,{"v":252.98221281347037,"d":"253"},{"$f":"C375*D375","v":10440},10440,{"$f":"C375*SQRT(360)/(D375-1)","v":{"v":243.94713378441784,"d":"243.9"}},360,29,0,0,10440,{"v":0,"d":"0%"},{"v":1490400,"d":"1,490,400"}]
["HP","HP 430*18.0",430,18,80.5,null,7740,{"$f":"C376*SQRT(360)/D376","v":{"v":453.25979795746775,"d":"453.3"}},383.75,18,80.5,46.25,{"v":10630.625,"d":"10631"},{"v":0.018259099616858343,"d":"2%"},{"v":2376052.083333333,"d":"2,376,052"}]
["flat","F 360 x 29",380,28,{"v":267.0367801919965,"d":"267"},{"$f":"C377*D377","v":10640},10640,{"$f":"C377*SQRT(360)/(D377-1)","v":{"v":267.03678019199646,"d":"267.0"}},{"$f":"C377","v":380},{"$f":"D377","v":28},0,0,10640,{"v":8.8188606032102435E-4,"d":"0%"},{"v":1636533.3333333333,"d":"1,636,533"}]
["L","L  500*13.5*120*35.0",500,13.5,120,35,6750,{"$f":"C378*SQRT(360)/D378","v":{"v":702.7283689263065,"d":"702.7"}},486.5,13.5,120,35,{"v":10767.75,"d":"10768"},{"v":0.012006578947368451,"d":"1%"},{"v":3472616.7291666665,"d":"3,472,617"}]
["built_t",{"$f":"CONCATENATE(\"T \",C379,\" x \",D379, \", \",E379,\" x \",F379)","v":"T 400 x 18, 200 x 18"},400,18,{"$f":"MIN(C379/2+10,200)","v":200},{"$f":"D379","v":18},7200,{"$f":"C379*SQRT(360)/(D379-1)","v":{"v":446.43919908259477,"d":"446.4"}},{"$f":"C379","v":400},{"$f":"D379","v":18},{"$f":"E379","v":200},{"$f":"F379","v":18},{"$f":"I379*J379+K379*L379","v":10800},{"v":0.00299505467716088,"d":"0%"},{"v":2506666.6666666665,"d":"2,506,667"}]
["flat","F 380 x 26",360,30,{"v":243.94713378441784,"d":"244"},{"$f":"C380*D380","v":10800},10800,{"$f":"C380*SQRT(360)/(D380-1)","v":{"v":235.53516365392068,"d":"235.5"}},{"$f":"C380","v":360},{"$f":"D380","v":30},0,0,10800,{"v":0,"d":"0%"},{"v":1512000,"d":"1,512,000"}]
["cropped_I","IPE 500 V _cropped",514,14.2,204,23,7298.799999999999,{"$f":"C381*SQRT(360)/D381","v":{"v":686.7932608422029,"d":"686.8"}},444,14.2,204,23,{"v":10996.8,"d":"10997"},{"v":0.01822222222222214,"d":"2%"},{"v":3169627.2,"d":"3,169,627"}]
["built_t",{"$f":"CONCATENATE(\"T \",C382,\" x \",D382, \", \",E382,\" x \",F382)","v":"T 360 x 20, 190 x 20"},360,20,{"$f":"MIN(C382/2+10,200)","v":190},{"$f":"D382","v":20},7200,{"$f":"C382*SQRT(360)/(D382-1)","v":{"v":359.50103926124734,"d":"359.5"}},{"$f":"C382","v":360},{"$f":"D382","v":20},{"$f":"E382","v":190},{"$f":"F382","v":20},{"$f":"I382*J382+K382*L382","v":11000},{"v":2.909937436346155E-4,"d":"0%"},{"v":2208000,"d":"2,208,000"}]
["flat","F 380 x 28",380,29,{"v":257.4997523279966,"d":"257"},{"$f":"C383*D383","v":11020},11020,{"$f":"C383*SQRT(360)/(D383-1)","v":{"v":257.4997523279966,"d":"257.5"}},{"$f":"C383","v":380},{"$f":"D383","v":29},0,0,11020,{"v":1.8181818181817189E-3,"d":"0%"},{"v":1660599.9999999998,"d":"1,660,600"}]
["HP","HP 430*19.0",430,19,81.5,null,8170,{"$f":"C384*SQRT(360)/D384","v":{"v":429.404019117601,"d":"429.4"}},383.75,19,81.5,46.25,{"v":11060.625,"d":"11061"},{"v":0.003686479128856668,"d":"0%"},{"v":2412428.3854166665,"d":"2,412,428"}]
["built_t",{"$f":"CONCATENATE(\"T \",C385,\" x \",D385, \", \",E385,\" x \",F385)","v":"T 420 x 18, 200 x 18"},420,18,{"$f":"MIN(C385/2+10,200)","v":200},{"$f":"D385","v":18},7560,{"$f":"C385*SQRT(360)/(D385-1)","v":{"v":468.7611590367245,"d":"468.8"}},{"$f":"C385","v":420},{"$f":"D385","v":18},{"$f":"E385","v":200},{"$f":"F385","v":18},{"$f":"I385*J385+K385*L385","v":11160},{"v":0.00898457365655192,"d":"1%"},{"v":2713200,"d":"2,713,200"}]
["flat","F 360 x 28",360,31,{"v":235.53516365392068,"d":"236"},{"$f":"C386*D386","v":11160},11160,{"$f":"C386*SQRT(360)/(D386-1)","v":{"v":227.68399153212331,"d":"227.7"}},{"$f":"C386","v":360},31,0,0,11160,{"v":0,"d":"0%"},{"v":1533600,"d":"1,533,600"}]
["flat","F 400 x 28",400,28,{"v":281.0913475705226,"d":"281"},{"$f":"C387*D387","v":11200},11200,{"$f":"C387*SQRT(360)/(D387-1)","v":{"v":281.0913475705226,"d":"281.1"}},400,28,0,0,11200,{"v":3.5842293906809264E-3,"d":"0%"},{"v":1813333.333333333,"d":"1,813,333"}]
["flat","F 400 x 27",380,30,{"v":248.62045052358295,"d":"249"},{"$f":"C388*D388","v":11400},11400,{"$f":"C388*SQRT(360)/(D388-1)","v":{"v":248.62045052358292,"d":"248.6"}},380,30,0,0,11400,{"$f":"M388/M387-1","v":{"v":0.017857142857142794,"d":"2%"}},{"v":1684666.6666666665,"d":"1,684,667"}]
["built_t",{"$f":"CONCATENATE(\"T \",C389,\" x \",D389, \", \",E389,\" x \",F389)","v":"T 340 x 22, 180 x 22"},340,22,{"$f":"MIN(C389/2+10,200)","v":180},{"$f":"D389","v":22},{"$f":"C389*D389","v":7480},{"$f":"C389*SQRT(360)/(D389-1)","v":{"v":307.1926869877854,"d":"307.2"}},340,22,{"$f":"E389","v":180},{"$f":"F389","v":22},{"$f":"I389*J389+K389*L389","v":11440},{"v":3.5087719298245723E-3,"d":"0%"},{"v":2092133.3333333333,"d":"2,092,133"}]
["half_I","IPE 600 V _half",618,18,228,28,11124,{"$f":"C390*SQRT(360)/D390","v":{"v":651.4291979946861,"d":"651.4"}},281,18,228,28,11442,{"v":1.7482517482525495E-4,"d":"0%"},{"v":1959225.6666666665,"d":"1,959,226"}]
["HP","HP 430*20.0",430,20,82.5,null,8600,{"$f":"C391*SQRT(360)/D391","v":{"v":407.933818161721,"d":"407.9"}},383.75,20,82.5,46.25,{"v":11490.625,"d":"11491"},{"v":4.2496941094214424E-3,"d":"0%"},{"v":2448804.6875,"d":"2,448,805"}]
["built_t",{"$f":"CONCATENATE(\"T \",C392,\" x \",D392, \", \",E392,\" x \",F392)","v":"T 440 x 18, 200 x 18"},440,18,{"$f":"MIN(C392/2+10,200)","v":200},{"$f":"D392","v":18},7920,{"$f":"C392*SQRT(360)/(D392-1)","v":{"v":491.0831189908542,"d":"491.1"}},{"$f":"C392","v":440},{"$f":"D392","v":18},{"$f":"E392","v":200},{"$f":"F392","v":18},{"$f":"I392*J392+K392*L392","v":11520},{"v":2.556431873810272E-3,"d":"0%"},{"v":2927466.6666666665,"d":"2,927,467"}]
["cropped_I","IPE 550 R _cropped",560,14,210,22.2,7840,{"$f":"C393*SQRT(360)/D393","v":{"v":758.9466384404111,"d":"758.9"}},491.5999999999999,14,210,22.2,{"v":11544.399999999998,"d":"11544"},{"v":2.1180555555553315E-3,"d":"0%"},{"v":3702927.8399999985,"d":"3,702,928"}]
["built_t",{"$f":"CONCATENATE(\"T \",C394,\" x \",D394, \", \",E394,\" x \",F394)","v":"T 380 x 20, 200 x 20"},380,20,{"$f":"MIN(C394/2+10,200)","v":200},{"$f":"D394","v":20},7600,{"$f":"C394*SQRT(360)/(D394-1)","v":{"v":379.4733192202055,"d":"379.5"}},{"$f":"C394","v":380},{"$f":"D394","v":20},{"$f":"E394","v":200},{"$f":"F394","v":20},{"$f":"I394*J394+K394*L394","v":11600},{"v":0.004816187935276162,"d":"0%"},{"v":2457333.333333333,"d":"2,457,333"}]
["flat","F 380 x 30",400,29,{"v":271.05237087157536,"d":"271"},{"$f":"C395*D395","v":11600},11600,{"$f":"C395*SQRT(360)/(D395-1)","v":{"v":271.05237087157536,"d":"271.1"}},{"$f":"C395","v":400},29,0,0,11600,{"v":0,"d":"0%"},{"v":1839999.9999999998,"d":"1,840,000"}]
["flat","F 380 x 29",380,31,{"v":240.33310217279683,"d":"240"},{"$f":"C396*D396","v":11780},11780,{"$f":"C396*SQRT(360)/(D396-1)","v":{"v":240.33310217279683,"d":"240.3"}},380,31,0,0,11780,{"v":0.01551724137931032,"d":"2%"},{"v":1708733.3333333333,"d":"1,708,733"}]
["built_t",{"$f":"CONCATENATE(\"T \",C397,\" x \",D397, \", \",E397,\" x \",F397)","v":"T 460 x 18, 200 x 18"},460,18,{"$f":"MIN(C397/2+10,200)","v":200},{"$f":"D397","v":18},8280,{"$f":"C397*SQRT(360)/(D397-1)","v":{"v":513.4050789449839,"d":"513.4"}},460,18,{"$f":"E397","v":200},{"$f":"F397","v":18},{"$f":"I397*J397+K397*L397","v":11880},{"v":0.008488964346349714,"d":"1%"},{"v":3149466.666666666,"d":"3,149,467"}]
["HP","HP 430*21.0",430,21,83.5,null,9030,{"$f":"C398*SQRT(360)/D398","v":{"v":388.50839824925805,"d":"388.5"}},383.75,21,83.5,46.25,{"v":11920.625,"d":"11921"},{"v":0.003419612794612892,"d":"0%"},{"v":2485180.989583333,"d":"2,485,181"}]
["built_t",{"$f":"CONCATENATE(\"T \",C399,\" x \",D399, \", \",E399,\" x \",F399)","v":"T 400 x 20, 200 x 20"},400,20,{"$f":"MIN(C399/2+10,200)","v":200},{"$f":"D399","v":20},8000,{"$f":"C399*SQRT(360)/(D399-1)","v":{"v":399.4455991791637,"d":"399.4"}},{"$f":"C399","v":400},{"$f":"D399","v":20},{"$f":"E399","v":200},{"$f":"F399","v":20},{"$f":"I399*J399+K399*L399","v":12000},{"v":0.006658627379017457,"d":"1%"},{"v":2666666.6666666665,"d":"2,666,667"}]
["flat","F 400 x 29",400,30,{"v":261.70573739324516,"d":"262"},{"$f":"C400*D400","v":12000},12000,{"v":261.7057373932452,"d":"261.7"},{"$f":"C400","v":400},{"$f":"D400","v":30},0,0,12000,{"v":0,"d":"0%"},{"v":1866666.6666666665,"d":"1,866,667"}]
["built_t",{"$f":"CONCATENATE(\"T \",C401,\" x \",D401, \", \",E401,\" x \",F401)","v":"T 360 x 22, 190 x 22"},360,22,{"$f":"MIN(C401/2+10,200)","v":190},{"$f":"D401","v":22},7920,{"v":325.26284504589046,"d":"325.3"},360,22,{"$f":"E401","v":190},22,{"$f":"I401*J401+K401*L401","v":12100},{"v":0.008333333333333304,"d":"1%"},{"v":2342400,"d":"2,342,400"}]
["built_t",{"$f":"CONCATENATE(\"T \",C402,\" x \",D402, \", \",E402,\" x \",F402)","v":"T 480 x 18, 200 x 18"},480,18,{"$f":"MIN(C402/2+10,200)","v":200},{"$f":"D402","v":18},8640,{"v":535.7270388991137,"d":"535.7"},480,18,200,18,{"$f":"I402*J402+K402*L402","v":12240},{"v":0.011570247933884392,"d":"1%"},{"v":3379200,"d":"3,379,200"}]
["built_t",{"$f":"CONCATENATE(\"T \",C403,\" x \",D403, \", \",E403,\" x \",F403)","v":"T 420 x 20, 200 x 20"},420,20,{"$f":"MIN(C403/2+10,200)","v":200},{"$f":"D403","v":20},8400,{"v":419.4178791381219,"d":"419.4"},420,20,200,20,{"$f":"I403*J403+K403*L403","v":12400},{"v":0.013071895424836555,"d":"1%"},{"v":2884000,"d":"2,884,000"}]
["flat","F 420 x 28",400,31,{"v":252.98221281347037,"d":"253"},{"$f":"C404*D404","v":12400},12400,{"v":252.98221281347034,"d":"253.0"},400,31,0,0,12400,{"v":0,"d":"0%"},{"v":1893333.333333333,"d":"1,893,333"}]
["flat","F 400 x 31",420,30,{"v":284.60498941515414,"d":"285"},{"$f":"C405*D405","v":12600},12600,{"v":274.79102426290746,"d":"274.8"},420,30,0,0,12600,{"v":0.016129032258064502,"d":"2%"},{"v":2058000,"d":"2,058,000"}]
["built_t",{"$f":"CONCATENATE(\"T \",C406,\" x \",D406, \", \",E406,\" x \",F406)","v":"T 380 x 22, 200 x 22"},380,22,{"$f":"MIN(C406/2+10,200)","v":200},{"$f":"D406","v":22},8360,{"v":343.33300310399545,"d":"343.3"},380,22,{"$f":"E406","v":200},{"$f":"F406","v":22},{"$f":"I406*J406+K406*L406","v":12760},{"v":0.012698412698412653,"d":"1%"},{"$f":"1/6*I406*(4*K406*L406+J406*I406+40*I406)","v":{"v":2606800,"d":"2,606,800"}}]
["built_t",{"$f":"CONCATENATE(\"T \",C407,\" x \",D407, \", \",E407,\" x \",F407)","v":"T 440 x 20, 200 x 20"},440,20,{"$f":"MIN(C407/2+10,200)","v":200},{"$f":"D407","v":20},8800,{"v":439.3901590970801,"d":"439.4"},440,20,{"$f":"E407","v":200},{"$f":"F407","v":20},{"$f":"I407*J407+K407*L407","v":12800},{"v":3.1347962382444194E-3,"d":"0%"},{"v":3109333.333333333,"d":"3,109,333"}]
["flat","F 400 x 30",400,32,{"v":244.82149627110033,"d":"245"},{"$f":"C408*D408","v":12800},12800,{"v":244.82149627110033,"d":"244.8"},400,32,0,0,12800,{"v":0,"d":"0%"},{"v":1919999.9999999998,"d":"1,920,000"}]
["flat","F 420 x 30",420,31,{"v":274.79102426290746,"d":"275"},{"$f":"C409*D409","v":13020},13020,{"v":265.63132345414385,"d":"265.6"},420,31,0,0,13020,{"v":0.01718749999999991,"d":"2%"},{"v":2087400,"d":"2,087,400"}]
["built_t",{"$f":"CONCATENATE(\"T \",C410,\" x \",D410, \", \",E410,\" x \",F410)","v":"T 360 x 24, 190 x 24"},360,24,{"$f":"MIN(C410/2+10,200)","v":190},{"$f":"D410","v":24},8640,{"v":296.97911938972607,"d":"297.0"},360,24,{"$f":"E410","v":190},24,{"$f":"I410*J410+K410*L410","v":13200},{"v":0.01382488479262678,"d":"1%"},{"v":2476800,"d":"2,476,800"}]
["built_t",{"$f":"CONCATENATE(\"T \",C411,\" x \",D411, \", \",E411,\" x \",F411)","v":"T 400 x 22, 200 x 22"},400,22,{"$f":"MIN(C411/2+10,200)","v":200},{"$f":"D411","v":22},8800,{"v":361.4031611621005,"d":"361.4"},400,22,200,22,{"$f":"I411*J411+K411*L411","v":13200},{"v":0,"d":"0%"},{"v":2826666.666666666,"d":"2,826,667"}]
["built_t",{"$f":"CONCATENATE(\"T \",C412,\" x \",D412, \", \",E412,\" x \",F412)","v":"T 460 x 20, 200 x 20"},460,20,{"$f":"MIN(C412/2+10,200)","v":200},{"$f":"D412","v":20},9200,{"v":459.3624390560382,"d":"459.4"},460,20,200,20,{"$f":"I412*J412+K412*L412","v":13200},{"v":0,"d":"0%"},{"v":3342666.666666666,"d":"3,342,667"}]
["flat","F 420 x 29",400,33,{"v":237.17082451262846,"d":"237"},{"$f":"C413*D413","v":13200},13200,{"v":237.17082451262846,"d":"237.2"},400,33,0,0,13200,{"v":0,"d":"0%"},{"v":1946666.6666666663,"d":"1,946,667"}]
["flat","F 400 x 32",420,32,{"v":265.63132345414385,"d":"266"},{"$f":"C414*D414","v":13440},13440,{"v":257.06257108465536,"d":"257.1"},420,32,0,0,13440,{"v":0.018181818181818077,"d":"2%"},{"v":2116800,"d":"2,116,800"}]
["cropped_I","IPE 600 O _cropped",610,15,224,24,9150,{"v":197,"d":"197.0"},538,15,224,24,13446,{"v":4.4642857142851433E-4,"d":"0%"},{"v":4581428.666666666,"d":"4,581,429"}]
["built_t",{"$f":"CONCATENATE(\"T \",C416,\" x \",D416, \", \",E416,\" x \",F416)","v":"T 420 x 22, 200 x 22"},420,22,{"$f":"MIN(C416/2+10,200)","v":200},{"$f":"D416","v":22},9240,{"$f":"C416*SQRT(360)/(D416-1)","v":{"v":379.47331922020555,"d":"379.5"}},{"$f":"C416","v":420},{"$f":"D416","v":22},{"$f":"E416","v":200},{"$f":"F416","v":22},{"$f":"I416*J416+K416*L416","v":13640},{"v":0.014428082701175127,"d":"1%"},{"v":3054800,"d":"3,054,800"}]
["flat","F 420 x 33",440,31,{"v":241.48302132194897,"d":"241"},{"$f":"C417*D417","v":13640},13640,{"$f":"C417*SQRT(360)/(D417-1)","v":{"v":278.2804340948174,"d":"278.3"}},{"$f":"C417","v":440},{"$f":"D417","v":31},0,0,13640,{"v":0,"d":"0%"},{"v":2290933.333333333,"d":"2,290,933"}]
["cropped_I","IPE 750 x 147_cropped",753,13.2,265,17,9939.6,{"v":187,"d":"187.0"},695,13.2,265,17,13679,{"v":2.8592375366569556E-3,"d":"0%"},{"v":6370138.333333333,"d":"6,370,138"}]
["flat","F 420 x 31",420,33,{"v":257.06257108465536,"d":"257"},{"$f":"C419*D419","v":13860},13860,{"$f":"C419*SQRT(360)/(D419-1)","v":{"v":249.02936573825988,"d":"249.0"}},{"$f":"C419","v":420},{"$f":"D419","v":33},0,0,13860,{"v":0.013231961400687275,"d":"1%"},{"v":2146200,"d":"2,146,200"}]
["cropped_I","IPE 550 V _cropped",566,17.1,216,25.2,9678.6,{"v":202,"d":"202.0"},498.5999999999999,17.1,216,25.2,{"v":13969.259999999998,"d":"13969"},{"v":0.007883116883116825,"d":"1%"},{"v":4175181.6659999993,"d":"4,175,182"}]
["built_t",{"$f":"CONCATENATE(\"T \",C421,\" x \",D421, \", \",E421,\" x \",F421)","v":"T 500 x 20, 200 x 20"},500,20,{"$f":"MIN(C421/2+10,200)","v":200},{"$f":"D421","v":20},10000,{"$f":"C421*SQRT(360)/(D421-1)","v":{"v":499.30699897395465,"d":"499.3"}},{"$f":"C421","v":500},20,200,20,{"$f":"I421*J421+K421*L421","v":14000},{"v":2.2005460561262957E-3,"d":"0%"},{"v":3833333.333333333,"d":"3,833,333"}]
["built_t",{"$f":"CONCATENATE(\"T \",C422,\" x \",D422, \", \",E422,\" x \",F422)","v":"T 440 x 22, 200 x 22"},440,22,{"$f":"MIN(C422/2+10,200)","v":200},{"$f":"D422","v":22},9680,{"v":397.54347727831055,"d":"397.5"},440,22,200,22,{"$f":"I422*J422+K422*L422","v":14080},{"v":0.005714285714285783,"d":"1%"},{"v":3291200,"d":"3,291,200"}]
["flat","F 420 x 32",420,34,{"v":249.02936573825988,"d":"249"},{"$f":"C423*D423","v":14280},14280,{"v":241.48302132194897,"d":"241.5"},{"$f":"C423","v":420},34,0,0,14280,{"v":0.014204545454545414,"d":"1%"},{"v":2175600,"d":"2,175,600"}]
["built_t",{"$f":"CONCATENATE(\"T \",C424,\" x \",D424, \", \",E424,\" x \",F424)","v":"T 400 x 24, 200 x 24"},400,24,{"$f":"MIN(C424/2+10,200)","v":200},{"$f":"D424","v":24},9600,{"v":329.97679932191784,"d":"330.0"},400,24,{"$f":"E424","v":200},{"$f":"F424","v":24},{"$f":"I424*J424+K424*L424","v":14400},{"v":0.008403361344537785,"d":"1%"},{"v":2986666.666666666,"d":"2,986,667"}]
["built_t",{"$f":"CONCATENATE(\"T \",C425,\" x \",D425, \", \",E425,\" x \",F425)","v":"T 460 x 22, 200 x 22"},460,22,{"$f":"MIN(C425/2+10,200)","v":200},{"$f":"D425","v":22},10120,{"v":415.61363533641554,"d":"415.6"},460,22,{"$f":"E425","v":200},{"$f":"F425","v":22},{"$f":"I425*J425+K425*L425","v":14520},{"v":0.008333333333333304,"d":"1%"},{"v":3535866.666666666,"d":"3,535,867"}]
["flat","F 420 x 34",440,33,{"v":234.38057951836225,"d":"234"},{"$f":"C426*D426","v":14520},14520,{"v":260.8879069638913,"d":"260.9"},440,33,0,0,14520,{"v":0,"d":"0%"},{"v":2355466.6666666665,"d":"2,355,467"}]
["flat","F 420 x 36",460,32,{"v":221.35943621178654,"d":"221"},{"$f":"C427*D427","v":14720},14720,{"v":281.54472071176536,"d":"281.5"},460,32,0,0,14720,{"v":0.01377410468319562,"d":"1%"},{"v":2539199.9999999995,"d":"2,539,200"}]
["built_t",{"$f":"CONCATENATE(\"T \",C428,\" x \",D428, \", \",E428,\" x \",F428)","v":"T 540 x 20, 200 x 20"},540,20,{"$f":"MIN(C428/2+10,200)","v":200},{"$f":"D428","v":20},10800,{"v":539.251558891871,"d":"539.3"},540,20,{"$f":"E428","v":200},{"$f":"F428","v":20},{"$f":"I428*J428+K428*L428","v":14800},{"v":0.005434782608695565,"d":"1%"},{"v":4356000,"d":"4,356,000"}]
["cropped_I","IPE 750 x 161_cropped",758,13.8,266,19.3,10460.4,{"v":204,"d":"204.0"},702.4000000000001,13.8,266,19.3,{"v":14826.920000000002,"d":"14827"},{"v":1.8189189189190547E-3,"d":"0%"},{"v":6827833.728000001,"d":"6,827,834"}]
["built_t",{"$f":"CONCATENATE(\"T \",C430,\" x \",D430, \", \",E430,\" x \",F430)","v":"T 420 x 24, 200 x 24"},420,24,{"$f":"MIN(C430/2+10,200)","v":200},{"$f":"D430","v":24},10080,{"$f":"C430*SQRT(360)/(D430-1)","v":{"v":346.4756392880137,"d":"346.5"}},{"$f":"C430","v":420},24,200,24,{"$f":"I430*J430+K430*L430","v":14880},{"v":3.579974802588648E-3,"d":"0%"},{"v":3225600,"d":"3,225,600"}]
["built_t",{"$f":"CONCATENATE(\"T \",C431,\" x \",D431, \", \",E431,\" x \",F431)","v":"T 440 x 24, 200 x 24"},440,24,{"$f":"MIN(C431/2+10,200)","v":200},{"$f":"D431","v":24},10560,{"v":362.9744792541096,"d":"363.0"},440,24,200,24,{"$f":"I431*J431+K431*L431","v":15360},{"v":0.032258064516129004,"d":"3%"},{"v":3473066.6666666665,"d":"3,473,067"}]
["built_t",{"$f":"CONCATENATE(\"T \",C432,\" x \",D432, \", \",E432,\" x \",F432)","v":"T 500 x 22, 200 x 22"},500,22,{"$f":"MIN(C432/2+10,200)","v":200},{"$f":"D432","v":22},11000,{"v":451.75395145262564,"d":"451.8"},500,22,200,22,{"$f":"I432*J432+K432*L432","v":15400},{"v":2.6041666666667407E-3,"d":"0%"},{"v":4050000,"d":"4,050,000"}]
["flat","F 420 x 35",440,35,{"v":227.68399153212331,"d":"228"},{"$f":"C433*D433","v":15400},15400,{"v":245.5415594954271,"d":"245.5"},{"$f":"C433","v":440},35,0,0,15400,{"v":0,"d":"0%"},{"v":2420000,"d":"2,420,000"}]
["built_t",{"$f":"CONCATENATE(\"T \",C434,\" x \",D434, \", \",E434,\" x \",F434)","v":"T 400 x 26, 200 x 26"},400,26,{"$f":"MIN(C434/2+10,200)","v":200},{"$f":"D434","v":26},10400,{"v":303.5786553761644,"d":"303.6"},400,26,{"$f":"E434","v":200},{"$f":"F434","v":26},{"$f":"I434*J434+K434*L434","v":15600},{"v":0.01298701298701288,"d":"1%"},{"v":3146666.666666666,"d":"3,146,667"}]
["flat","F 420 x 37",460,34,{"v":215.03488089145,"d":"215"},{"$f":"C435*D435","v":15640},15640,{"v":264.4814043049917,"d":"264.5"},460,34,0,0,15640,{"v":2.564102564102555E-3,"d":"0%"},{"v":2609733.333333333,"d":"2,609,733"}]
["built_t",{"$f":"CONCATENATE(\"T \",C436,\" x \",D436, \", \",E436,\" x \",F436)","v":"T 460 x 24, 200 x 24"},460,24,{"$f":"MIN(C436/2+10,200)","v":200},{"$f":"D436","v":24},11040,{"v":379.4733192202055,"d":"379.5"},460,24,{"$f":"E436","v":200},{"$f":"F436","v":24},{"$f":"I436*J436+K436*L436","v":15840},{"v":0.01278772378516635,"d":"1%"},{"v":3729066.666666666,"d":"3,729,067"}]
["cropped_I","IPE 750 x 173_cropped",762,14.4,267,21.6,10972.800000000001,{"v":221,"d":"221.0"},701.8,14.4,267,21.6,{"v":15873.12,"d":"15873"},{"v":2.0909090909091432E-3,"d":"0%"},{"v":7163824.682666666,"d":"7,163,825"}]
["built_t",{"$f":"CONCATENATE(\"T \",C438,\" x \",D438, \", \",E438,\" x \",F438)","v":"T 420 x 26, 200 x 26"},420,26,{"$f":"MIN(C438/2+10,200)","v":200},{"$f":"D438","v":26},10920,{"$f":"C438*SQRT(360)/(D438-1)","v":{"v":318.75758814497266,"d":"318.8"}},{"$f":"C438","v":420},{"$f":"D438","v":26},{"$f":"E438","v":200},{"$f":"F438","v":26},{"$f":"I438*J438+K438*L438","v":16120},{"v":0.015553337970102943,"d":"2%"},{"v":3396400,"d":"3,396,400"}]
["cropped_I","IPE 600 V _cropped",618,18,228,28,11124,{"v":234,"d":"234.0"},545,18,228,28,16194,{"v":0.004590570719603004,"d":"0%"},{"v":5190761.666666666,"d":"5,190,762"}]
["built_t",{"$f":"CONCATENATE(\"T \",C440,\" x \",D440, \", \",E440,\" x \",F440)","v":"T 540 x 22, 200 x 22"},540,22,{"$f":"MIN(C440/2+10,200)","v":200},{"$f":"D440","v":22},11880,{"$f":"C440*SQRT(360)/(D440-1)","v":{"v":487.8942675688357,"d":"487.9"}},{"$f":"C440","v":540},{"$f":"D440","v":22},{"$f":"E440","v":200},{"$f":"F440","v":22},{"$f":"I440*J440+K440*L440","v":16280},{"v":5.310608867481692E-3,"d":"1%"},{"v":4597200,"d":"4,597,200"}]
["flat","F 420 x 39",480,34,{"v":208.710325571113,"d":"209"},{"$f":"C441*D441","v":16320},16320,{"$f":"C441*SQRT(360)/(D441-1)","v":{"v":275.9805957965131,"d":"276.0"}},{"$f":"C441","v":480},34,0,0,16320,{"v":0.002457002457002533,"d":"0%"},{"v":2841600,"d":"2,841,600"}]
["flat","F 420 x 38",460,36,{"v":208.710325571113,"d":"209"},{"$f":"C442*D442","v":16560},16560,{"$f":"C442*SQRT(360)/(D442-1)","v":{"v":249.36818120184932,"d":"249.4"}},460,36,0,0,16560,{"v":0.014705882352941124,"d":"1%"},{"v":2680266.6666666665,"d":"2,680,267"}]
["built_t",{"$f":"CONCATENATE(\"T \",C443,\" x \",D443, \", \",E443,\" x \",F443)","v":"T 440 x 26, 200 x 26"},440,26,{"$f":"MIN(C443/2+10,200)","v":200},{"$f":"D443","v":26},11440,{"$f":"C443*SQRT(360)/(D443-1)","v":{"v":333.93652091378084,"d":"333.9"}},440,26,{"$f":"E443","v":200},{"$f":"F443","v":26},{"$f":"I443*J443+K443*L443","v":16640},{"v":0.004830917874396157,"d":"0%"},{"v":3654933.333333333,"d":"3,654,933"}]
["cropped_I","IPE 750 x 185_cropped",766,14.9,267,23.6,11413.4,{"v":236,"d":"236.0"},701.8,14.9,267,23.6,{"v":16758.02,"d":"16758"},{"v":0.007092548076923055,"d":"1%"},{"v":7454709.085999999,"d":"7,454,709"}]
["built_t",{"$f":"CONCATENATE(\"T \",C445,\" x \",D445, \", \",E445,\" x \",F445)","v":"T 500 x 24, 200 x 24"},500,24,{"$f":"MIN(C445/2+10,200)","v":200},{"$f":"D445","v":24},12000,{"$f":"C445*SQRT(360)/(D445-1)","v":{"v":412.4709991523973,"d":"412.5"}},{"$f":"C445","v":500},24,200,24,{"$f":"I445*J445+K445*L445","v":16800},{"v":2.505069214620903E-3,"d":"0%"},{"v":4266666.666666666,"d":"4,266,667"}]
["built_t",{"$f":"CONCATENATE(\"T \",C446,\" x \",D446, \", \",E446,\" x \",F446)","v":"T 460 x 26, 200 x 26"},460,26,{"$f":"MIN(C446/2+10,200)","v":200},{"$f":"D446","v":26},11960,{"v":349.1154536825891,"d":"349.1"},460,26,200,26,{"$f":"I446*J446+K446*L446","v":17160},{"v":0.021428571428571352,"d":"2%"},{"v":3922266.666666666,"d":"3,922,267"}]
["built_t",{"$f":"CONCATENATE(\"T \",C447,\" x \",D447, \", \",E447,\" x \",F447)","v":"T 580 x 22, 200 x 22"},580,22,{"$f":"MIN(C447/2+10,200)","v":200},{"$f":"D447","v":22},12760,{"v":524.0345836850457,"d":"524.0"},580,22,200,22,{"$f":"I447*J447+K447*L447","v":17160},{"v":0,"d":"0%"},{"v":5177466.666666666,"d":"5,177,467"}]
["flat","F 420 x 40",480,36,{"v":208.710325571113,"d":"209"},{"$f":"C448*D448","v":17280},17280,{"v":260.21027603671234,"d":"260.2"},{"$f":"C448","v":480},36,0,0,17280,{"v":0.006993006993007089,"d":"1%"},{"v":2918400,"d":"2,918,400"}]
["built_t",{"$f":"CONCATENATE(\"T \",C449,\" x \",D449, \", \",E449,\" x \",F449)","v":"T 420 x 28, 200 x 28"},420,28,{"$f":"MIN(C449/2+10,200)","v":200},{"$f":"D449","v":28},11760,{"v":295.14591494904874,"d":"295.1"},420,28,{"$f":"E449","v":200},{"$f":"F449","v":28},{"$f":"I449*J449+K449*L449","v":17360},{"v":0.004629629629629539,"d":"0%"},{"v":3567200,"d":"3,567,200"}]
["flat","F 420 x 42",500,35,{"v":208.710325571113,"d":"209"},{"$f":"C450*D450","v":17500},17500,{"v":279.02449942662173,"d":"279.0"},500,35,0,0,17500,{"v":0.008064516129032251,"d":"1%"},{"v":3125000,"d":"3,125,000"}]
["built_t",{"$f":"CONCATENATE(\"T \",C451,\" x \",D451, \", \",E451,\" x \",F451)","v":"T 540 x 24, 200 x 24"},540,24,{"$f":"MIN(C451/2+10,200)","v":200},{"$f":"D451","v":24},12960,{"v":445.4686790845891,"d":"445.5"},540,24,{"$f":"E451","v":200},{"$f":"F451","v":24},{"$f":"I451*J451+K451*L451","v":17760},{"v":0.014857142857142902,"d":"1%"},{"v":4838400,"d":"4,838,400"}]
["cropped_I","IPE 750 x 196_cropped",770,15.6,268,25.4,12012,{"v":251,"d":"251.0"},702.2,15.6,268,25.4,{"v":17761.52,"d":"17762"},{"$f":"M452/M451-1","v":{"v":8.5585585585690183E-5,"d":"0%"}},{"v":7755930.077333333,"d":"7,755,930"}]
["built_t",{"$f":"CONCATENATE(\"T \",C453,\" x \",D453, \", \",E453,\" x \",F453)","v":"T 440 x 28, 200 x 28"},440,28,{"$f":"MIN(C453/2+10,200)","v":200},{"$f":"D453","v":28},{"$f":"C453*D453","v":12320},{"$f":"C453*SQRT(360)/(D453-1)","v":{"v":309.20048232757483,"d":"309.2"}},{"$f":"C453","v":440},28,200,28,{"$f":"I453*J453+K453*L453","v":17920},{"v":0.00892265977236173,"d":"1%"},{"v":3836799.9999999995,"d":"3,836,800"}]
["built_t",{"$f":"CONCATENATE(\"T \",C454,\" x \",D454, \", \",E454,\" x \",F454)","v":"T 500 x 26, 200 x 26"},500,26,{"$f":"MIN(C454/2+10,200)","v":200},{"$f":"D454","v":26},13000,{"$f":"C454*SQRT(360)/(D454-1)","v":{"v":379.4733192202055,"d":"379.5"}},500,26,200,26,{"$f":"I454*J454+K454*L454","v":18200},{"v":0.015625,"d":"2%"},{"v":4483333.333333333,"d":"4,483,333"}]
["flat","F 420 x 41",480,38,{"v":208.710325571113,"d":"209"},{"$f":"C455*D455","v":18240},18240,{"$f":"C455*SQRT(360)/(D455-1)","v":{"v":246.1448557104036,"d":"246.1"}},{"$f":"C455","v":480},38,0,0,18240,{"v":2.19780219780219E-3,"d":"0%"},{"v":2995200,"d":"2,995,200"}]
["flat","F 420 x 43",500,37,{"v":208.710325571113,"d":"209"},{"$f":"C456*D456","v":18500},18500,{"$f":"C456*SQRT(360)/(D456-1)","v":{"v":263.5231383473649,"d":"263.5"}},500,37,0,0,18500,{"v":0.014254385964912242,"d":"1%"},{"v":3208333.333333333,"d":"3,208,333"}]
["built_t",{"$f":"CONCATENATE(\"T \",C457,\" x \",D457, \", \",E457,\" x \",F457)","v":"T 580 x 24, 200 x 24"},580,24,{"$f":"MIN(C457/2+10,200)","v":200},{"$f":"D457","v":24},13920,{"$f":"C457*SQRT(360)/(D457-1)","v":{"v":478.4663590167809,"d":"478.5"}},580,24,{"$f":"E457","v":200},{"$f":"F457","v":24},{"$f":"I457*J457+K457*L457","v":18720},{"v":0.011891891891891992,"d":"1%"},{"v":5444266.666666666,"d":"5,444,267"}]
["cropped_I","IPE 750 x 210_cropped",775,16,268,28,12400,{"v":268,"d":"268.0"},702,16,268,28,18736,{"v":8.5470085470085166E-4,"d":"0%"},{"v":8111376,"d":"8,111,376"}]
["built_t",{"$f":"CONCATENATE(\"T \",C459,\" x \",D459, \", \",E459,\" x \",F459)","v":"T 540 x 26, 200 x 26"},540,26,{"$f":"MIN(C459/2+10,200)","v":200},{"$f":"D459","v":26},14040,{"$f":"C459*SQRT(360)/(D459-1)","v":{"v":409.831184757822,"d":"409.8"}},{"$f":"C459","v":540},{"$f":"D459","v":26},{"$f":"E459","v":200},{"$f":"F459","v":26},{"$f":"I459*J459+K459*L459","v":19240},{"v":0.02690008539709643,"d":"3%"},{"v":5079600,"d":"5,079,600"}]
["flat","F 420 x 45",525,37,{"v":208.710325571113,"d":"209"},{"$f":"C460*D460","v":19425},19425,{"v":276.69929526473317,"d":"276.7"},{"$f":"C460","v":525},37,0,0,19425,{"v":0.009615384615384581,"d":"1%"},{"v":3537187.5,"d":"3,537,188"}]
["built_t",{"$f":"CONCATENATE(\"T \",C461,\" x \",D461, \", \",E461,\" x \",F461)","v":"T 450 x 30, 200 x 30"},450,30,{"$f":"MIN(C461/2+10,200)","v":200},{"$f":"D461","v":30},13500,{"v":294.4189545674009,"d":"294.4"},450,30,{"$f":"E461","v":200},{"$f":"F461","v":30},{"$f":"I461*J461+K461*L461","v":19500},{"v":3.8610038610038533E-3,"d":"0%"},{"v":4162500,"d":"4,162,500"}]
["flat","F 420 x 44",500,39,{"v":208.710325571113,"d":"209"},{"$f":"C462*D462","v":19500},19500,{"v":249.65349948697732,"d":"249.7"},500,39,0,0,19500,{"v":0,"d":"0%"},{"v":3291666.6666666665,"d":"3,291,667"}]
["built_t",{"$f":"CONCATENATE(\"T \",C463,\" x \",D463, \", \",E463,\" x \",F463)","v":"T 500 x 28, 200 x 28"},500,28,{"$f":"MIN(C463/2+10,200)","v":200},{"$f":"D463","v":28},14000,{"v":351.36418446315326,"d":"351.4"},500,28,{"$f":"E463","v":200},{"$f":"F463","v":28},{"$f":"I463*J463+K463*L463","v":19600},{"v":5.12820512820511E-3,"d":"1%"},{"v":4700000,"d":"4,700,000"}]
["built_t",{"$f":"CONCATENATE(\"T \",C464,\" x \",D464, \", \",E464,\" x \",F464)","v":"T 620 x 24, 200 x 24"},620,24,{"$f":"MIN(C464/2+10,200)","v":200},{"$f":"D464","v":24},14880,{"v":511.4640389489727,"d":"511.5"},620,24,{"$f":"E464","v":200},{"$f":"F464","v":24},{"$f":"I464*J464+K464*L464","v":19680},{"v":0.004081632653061273,"d":"0%"},{"v":6084266.666666666,"d":"6,084,267"}]
["cropped_I","IPE 750 x 222_cropped",778,17,269,29.5,13226,{"v":283,"d":"283.0"},702,17,269,29.5,{"v":19869.5,"d":"19870"},{"v":0.009629065040650309,"d":"1%"},{"v":8395452,"d":"8,395,452"}]
["built_t",{"$f":"CONCATENATE(\"T \",C466,\" x \",D466, \", \",E466,\" x \",F466)","v":"T 580 x 26, 200 x 26"},580,26,{"$f":"MIN(C466/2+10,200)","v":200},{"$f":"D466","v":26},15080,{"$f":"C466*SQRT(360)/(D466-1)","v":{"v":440.18905029543845,"d":"440.2"}},{"$f":"C466","v":580},26,200,26,{"$f":"I466*J466+K466*L466","v":20280},{"v":0.020659805229120032,"d":"2%"},{"v":5711066.666666666,"d":"5,711,067"}]
["built_t",{"$f":"CONCATENATE(\"T \",C467,\" x \",D467, \", \",E467,\" x \",F467)","v":"T 660 x 24, 200 x 24"},660,24,{"$f":"MIN(C467/2+10,200)","v":200},{"$f":"D467","v":24},15840,{"v":544.4617188811644,"d":"544.5"},660,24,200,24,{"$f":"I467*J467+K467*L467","v":20640},{"v":0.01775147928994092,"d":"2%"},{"v":6758400,"d":"6,758,400"}]
["built_t",{"$f":"CONCATENATE(\"T \",C468,\" x \",D468, \", \",E468,\" x \",F468)","v":"T 620 x 26, 200 x 26"},620,26,{"$f":"MIN(C468/2+10,200)","v":200},{"$f":"D468","v":26},16120,{"v":470.54691583305487,"d":"470.5"},620,26,200,26,{"$f":"I468*J468+K468*L468","v":21320},{"v":0.032945736434108586,"d":"3%"},{"v":6377733.333333333,"d":"6,377,733"}]
["built_t",{"$f":"CONCATENATE(\"T \",C469,\" x \",D469, \", \",E469,\" x \",F469)","v":"T 550 x 28, 200 x 30"},550,28,{"$f":"MIN(C469/2+10,200)","v":200},30,15400,{"v":386.50060290946857,"d":"386.5"},550,28,200,30,{"$f":"I469*J469+K469*L469","v":21400},{"v":3.7523452157599557E-3,"d":"0%"},{"v":5628333.333333333,"d":"5,628,333"}]
["flat","F 420 x 46",550,39,{"v":208.710325571113,"d":"209"},{"$f":"C470*D470","v":21450},21450,{"v":274.61884943567503,"d":"274.6"},{"$f":"C470","v":550},{"$f":"D470","v":39},0,0,21450,{"v":0.002336448598130758,"d":"0%"},{"$f":"1/6*I470*(4*K470*L470+J470*I470+40*I470)","v":{"v":3982916.666666666,"d":"3,982,917"}}]
["built_t",{"$f":"CONCATENATE(\"T \",C471,\" x \",D471, \", \",E471,\" x \",F471)","v":"T 500 x 30, 200 x 35"},500,30,{"$f":"MIN(C471/2+10,200)","v":200},35,15000,{"v":327.1321717415565,"d":"327.1"},500,30,{"$f":"E471","v":200},35,{"$f":"I471*J471+K471*L471","v":22000},{"v":0.02564102564102555,"d":"3%"},{"v":5250000,"d":"5,250,000"}]
["built_t",{"$f":"CONCATENATE(\"T \",C472,\" x \",D472, \", \",E472,\" x \",F472)","v":"T 660 x 26, 200 x 26"},660,26,{"$f":"MIN(C472/2+10,200)","v":200},{"$f":"D472","v":26},17160,{"v":500.9047813706713,"d":"500.9"},660,26,200,26,{"$f":"I472*J472+K472*L472","v":22360},{"v":0.016363636363636358,"d":"2%"},{"v":7079600,"d":"7,079,600"}]
["built_t",{"$f":"CONCATENATE(\"T \",C473,\" x \",D473, \", \",E473,\" x \",F473)","v":"T 500 x 32, 200 x 32"},500,32,{"$f":"MIN(C473/2+10,200)","v":200},{"$f":"D473","v":32},16000,{"v":306.0268703388754,"d":"306.0"},500,32,200,32,{"$f":"I473*J473+K473*L473","v":22400},{"v":1.7889087656528524E-3,"d":"0%"},{"v":5133333.333333333,"d":"5,133,333"}]
["flat","F 420 x 47",575,40,{"v":208.710325571113,"d":"209"},{"$f":"C474*D474","v":23000},23000,{"v":279.73994686104896,"d":"279.7"},575,40,0,0,23000,{"v":0.02678571428571419,"d":"3%"},{"v":4408333.333333333,"d":"4,408,333"}]
["built_t",{"$f":"CONCATENATE(\"T \",C475,\" x \",D475, \", \",E475,\" x \",F475)","v":"T 700 x 26, 200 x 26"},700,26,{"$f":"MIN(C475/2+10,200)","v":200},{"$f":"D475","v":26},18200,{"v":531.2626469082877,"d":"531.3"},700,26,{"$f":"E475","v":200},26,{"$f":"I475*J475+K475*L475","v":23400},{"v":0.017391304347825987,"d":"2%"},{"v":7816666.666666666,"d":"7,816,667"}]
["built_t",{"$f":"CONCATENATE(\"T \",C476,\" x \",D476, \", \",E476,\" x \",F476)","v":"T 550 x 30, 200 x 35"},550,30,{"$f":"MIN(C476/2+10,200)","v":200},35,16500,{"v":359.84538891571214,"d":"359.8"},550,30,200,35,{"$f":"I476*J476+K476*L476","v":23500},{"v":0.004273504273504258,"d":"0%"},{"v":6095833.333333333,"d":"6,095,833"}]
["built_t",{"$f":"CONCATENATE(\"T \",C477,\" x \",D477, \", \",E477,\" x \",F477)","v":"T 600 x 28, 200 x 35"},600,28,{"$f":"MIN(C477/2+10,200)","v":200},35,16800,{"v":421.63702135578393,"d":"421.6"},600,28,200,35,{"$f":"I477*J477+K477*L477","v":23800},{"v":0.012765957446808418,"d":"1%"},{"v":6880000,"d":"6,880,000"}]
["built_t",{"$f":"CONCATENATE(\"T \",C478,\" x \",D478, \", \",E478,\" x \",F478)","v":"T 550 x 32, 200 x 35"},550,32,{"$f":"MIN(C478/2+10,200)","v":200},35,17600,{"v":336.6295573727629,"d":"336.6"},550,32,200,35,{"$f":"I478*J478+K478*L478","v":24600},{"v":0.03361344537815136,"d":"3%"},{"v":6196666.666666666,"d":"6,196,667"}]
["built_t",{"$f":"CONCATENATE(\"T \",C479,\" x \",D479, \", \",E479,\" x \",F479)","v":"T 650 x 28, 200 x 35"},650,28,{"$f":"MIN(C479/2+10,200)","v":200},35,18200,{"v":456.77343980209923,"d":"456.8"},650,28,200,35,{"$f":"I479*J479+K479*L479","v":25200},{"v":0.024390243902439046,"d":"2%"},{"v":7821666.666666666,"d":"7,821,667"}]
["flat","F 420 x 48",600,42,{"v":208.710325571113,"d":"209"},{"$f":"C480*D480","v":25200},25200,{"v":277.6634043074675,"d":"277.7"},600,42,0,0,25200,{"v":0,"d":"0%"},{"v":4920000,"d":"4,920,000"}]
["built_t",{"$f":"CONCATENATE(\"T \",C481,\" x \",D481, \", \",E481,\" x \",F481)","v":"T 550 x 34, 200 x 35"},550,34,{"$f":"MIN(C481/2+10,200)","v":200},35,18700,{"v":316.2277660168379,"d":"316.2"},550,34,{"$f":"E481","v":200},35,{"$f":"I481*J481+K481*L481","v":25700},{"v":0.01984126984126977,"d":"2%"},{"v":6297499.999999999,"d":"6,297,500"}]
["built_t","T 600 x 30, 200 x 40",600,30,200,40,18000,{"v":392.5586060898678,"d":"392.6"},600,30,200,40,26000,{"v":0.011673151750972721,"d":"1%"},{"v":7400000,"d":"7,400,000"}]
["built_t","T 600 x 32, 200 x 35",600,32,200,35,19200,{"v":367.2322444066505,"d":"367.2"},600,32,200,35,26200,{"v":7.692307692307665E-3,"d":"1%"},{"v":7120000,"d":"7,120,000"}]
["built_t","T 700 x 28, 200 x 35",700,28,200,35,19600,{"v":491.90985824841454,"d":"491.9"},700,28,200,35,26600,{"v":0.01526717557251911,"d":"2%"},{"v":8820000,"d":"8,820,000"}]
["built_t","T 600 x 34, 200 x 35",600,34,200,35,20400,{"v":344.9757447456414,"d":"345.0"},600,34,200,35,27400,{"v":0.03007518796992481,"d":"3%"},{"v":7240000,"d":"7,240,000"}]
["built_t","T 650 x 30, 200 x 40",650,30,200,40,19500,{"v":425.27182326402345,"d":"425.3"},650,30,200,40,27500,{"v":3.6496350364962904E-3,"d":"0%"},{"v":8395833.333333332,"d":"8,395,833"}]
["flat","F 420 x 49",625,44,{"v":208.710325571113,"d":"209"},{"$f":"C487*D487","v":27500},27500,{"v":275.78002850305637,"d":"275.8"},625,44,0,0,27500,{"v":0,"d":"0%"},{"v":5468749.999999999,"d":"5,468,750"}]
["built_t",{"$f":"CONCATENATE(\"T \",C488,\" x \",D488, \", \",E488,\" x \",F488)","v":"T 750 x 28, 200 x 35"},750,28,{"$f":"MIN(C488/2+10,200)","v":200},35,21000,{"v":527.04627669473,"d":"527.0"},750,28,{"$f":"E488","v":200},35,{"$f":"I488*J488+K488*L488","v":28000},{"v":0.018181818181818077,"d":"2%"},{"v":9875000,"d":"9,875,000"}]
["built_t",{"$f":"CONCATENATE(\"T \",C489,\" x \",D489, \", \",E489,\" x \",F489)","v":"T 650 x 32, 200 x 40"},650,32,{"$f":"MIN(C489/2+10,200)","v":200},40,20800,{"v":397.83493144053807,"d":"397.8"},650,32,200,40,{"$f":"I489*J489+K489*L489","v":28800},{"v":0.02857142857142847,"d":"3%"},{"v":8536666.666666666,"d":"8,536,667"}]
["built_t",{"$f":"CONCATENATE(\"T \",C490,\" x \",D490, \", \",E490,\" x \",F490)","v":"T 700 x 30, 200 x 40"},700,30,{"$f":"MIN(C490/2+10,200)","v":200},40,21000,{"v":457.98504043817906,"d":"458.0"},700,30,200,40,{"$f":"I490*J490+K490*L490","v":29000},{"v":0.00694444444444442,"d":"1%"},{"v":9450000,"d":"9,450,000"}]
["built_t",{"$f":"CONCATENATE(\"T \",C491,\" x \",D491, \", \",E491,\" x \",F491)","v":"T 650 x 34, 200 x 35"},650,34,{"$f":"MIN(C491/2+10,200)","v":200},35,22100,{"v":373.72372347444485,"d":"373.7"},650,34,200,35,{"$f":"I491*J491+K491*L491","v":29100},{"v":3.4482758620688614E-3,"d":"0%"},{"v":8244166.666666666,"d":"8,244,167"}]
["flat","F 420 x 50",650,45,{"v":208.710325571113,"d":"209"},{"$f":"C492*D492","v":29250},29250,{"v":280.29279260583365,"d":"280.3"},650,45,0,0,29250,{"v":0.005154639175257714,"d":"1%"},{"v":5985416.666666666,"d":"5,985,417"}]
["built_t",{"$f":"CONCATENATE(\"T \",C493,\" x \",D493, \", \",E493,\" x \",F493)","v":"T 700 x 32, 200 x 40"},700,32,{"$f":"MIN(C493/2+10,200)","v":200},40,22400,{"v":428.43761847442556,"d":"428.4"},700,32,{"$f":"E493","v":200},{"$f":"F493","v":40},{"$f":"I493*J493+K493*L493","v":30400},{"v":0.0393162393162394,"d":"4%"},{"v":9613333.333333332,"d":"9,613,333"}]
["built_t",{"$f":"CONCATENATE(\"T \",C494,\" x \",D494, \", \",E494,\" x \",F494)","v":"T 750 x 30, 200 x 40"},750,30,{"$f":"MIN(C494/2+10,200)","v":200},40,{"$f":"C494*D494","v":22500},{"v":490.69825761233477,"d":"490.7"},750,30,{"$f":"E494","v":200},{"$f":"F494","v":40},{"$f":"I494*J494+K494*L494","v":30500},{"v":0.00328947368421062,"d":"0%"},{"v":10562500,"d":"10,562,500"}]
["flat","F 420 x 51",675,47,{"v":208.710325571113,"d":"209"},{"$f":"C495*D495","v":31725},31725,{"v":278.4179244278682,"d":"278.4"},675,47,0,0,31725,{"v":0.04016393442622945,"d":"4%"},{"v":6606562.5,"d":"6,606,563"}]
["built_t",{"$f":"CONCATENATE(\"T \",C496,\" x \",D496, \", \",E496,\" x \",F496)","v":"T 700 x 34, 200 x 40"},700,34,{"$f":"MIN(C496/2+10,200)","v":200},40,23800,{"v":402.47170220324824,"d":"402.5"},700,34,{"$f":"E496","v":200},40,{"$f":"I496*J496+K496*L496","v":31800},{"v":2.3640661938533203E-3,"d":"0%"},{"v":9776666.666666666,"d":"9,776,667"}]
["built_t",{"$f":"CONCATENATE(\"T \",C497,\" x \",D497, \", \",E497,\" x \",F497)","v":"T 750 x 32, 200 x 40"},750,32,{"$f":"MIN(C497/2+10,200)","v":200},40,24000,{"v":459.04030550831317,"d":"459.0"},750,32,200,40,{"$f":"I497*J497+K497*L497","v":32000},{"v":6.2893081761006275E-3,"d":"1%"},{"v":10750000,"d":"10,750,000"}]
["built_t",{"$f":"CONCATENATE(\"T \",C498,\" x \",D498, \", \",E498,\" x \",F498)","v":"T 800 x 30, 200 x 40"},800,30,{"$f":"MIN(C498/2+10,200)","v":200},40,24000,{"v":523.4114747864904,"d":"523.4"},800,30,200,40,{"$f":"I498*J498+K498*L498","v":32000},{"v":0,"d":"0%"},{"v":11733333.333333332,"d":"11,733,333"}]
["built_t",{"$f":"CONCATENATE(\"T \",C499,\" x \",D499, \", \",E499,\" x \",F499)","v":"T 750 x 34, 200 x 40"},750,34,{"$f":"MIN(C499/2+10,200)","v":200},40,25500,{"v":431.21968093205174,"d":"431.2"},750,34,200,40,{"$f":"I499*J499+K499*L499","v":33500},{"v":0.046875,"d":"5%"},{"v":10937500,"d":"10,937,500"}]
["built_t",{"$f":"CONCATENATE(\"T \",C500,\" x \",D500, \", \",E500,\" x \",F500)","v":"T 800 x 32, 200 x 40"},800,32,{"$f":"MIN(C500/2+10,200)","v":200},40,25600,{"v":489.64299254220066,"d":"489.6"},800,32,200,40,{"$f":"I500*J500+K500*L500","v":33600},{"v":2.9850746268655914E-3,"d":"0%"},{"v":11946666.666666664,"d":"11,946,667"}]
["flat","F 420 x 52",700,49,{"v":208.710325571113,"d":"209"},{"$f":"C501*D501","v":34300},34300,{"v":276.69929526473317,"d":"276.7"},700,49,0,0,34300,{"v":0.02083333333333326,"d":"2%"},{"v":7268333.333333333,"d":"7,268,333"}]
["built_t",{"$f":"CONCATENATE(\"T \",C502,\" x \",D502, \", \",E502,\" x \",F502)","v":"T 800 x 34, 200 x 40"},800,34,{"$f":"MIN(C502/2+10,200)","v":200},40,27200,{"v":459.9676596608552,"d":"460.0"},800,34,{"$f":"E502","v":200},{"$f":"F502","v":40},{"$f":"I502*J502+K502*L502","v":35200},{"v":0.026239067055393583,"d":"3%"},{"v":12159999.999999998,"d":"12,160,000"}]
["built_t","T 850 x 32, 200 x 40",850,32,200,40,27200,{"v":520.2456795760883,"d":"520.2"},850,32,200,40,35200,{"v":0,"d":"0%"},{"v":13203333.333333332,"d":"13,203,333"}]
["built_t","T 850 x 34, 200 x 40",850,34,200,40,28900,{"v":488.71563838965864,"d":"488.7"},850,34,200,40,36900,{"v":0.048295454545454586,"d":"5%"},{"v":13444166.666666666,"d":"13,444,167"}]
["built_t","T 900 x 34, 200 x 40",900,34,200,40,30600,{"v":517.4636171184621,"d":"517.5"},900,34,200,40,38600,{"v":0.046070460704606964,"d":"5%"},{"v":14790000,"d":"14,790,000"}]
["built_t","T 950 x 35, 200 x 40",950,35,200,40,33250,{"v":530.1465489105813,"d":"530.1"},950,35,200,40,41250,{"v":0.06865284974093266,"d":"7%"},{"v":16347916.666666664,"d":"16,347,917"}]
["built_t","T 1000 x 36, 200 x 40",1000,36,200,40,36000,{"v":542.1047417431507,"d":"542.1"},1000,36,200,40,44000,{"v":0.06666666666666665,"d":"7%"},{"v":18000000,"d":"18,000,000"}]
["built_t","T 1200 x 38, 200 x 40",1200,38,200,40,45600,{"v":615.362139276009,"d":"615.4"},1200,38,200,40,53600,{"v":0.21818181818181825,"d":"22%"},{"v":25120000,"d":"25,120,000"}]
["built_t","T 1400 x 40, 200 x 40",1400,40,200,40,56000,{"v":681.1059575747279,"d":"681.1"},1400,40,200,40,64000,{"v":0.19402985074626855,"d":"19%"},{"v":33600000,"d":"33,600,000"}]
["built_t","T 1600 x 42, 200 x 40",1600,42,200,40,67200,{"v":740.4357448199132,"d":"740.4"},1600,42,200,40,75200,{"v":0.17500000000000004,"d":"18%"},{"v":43519999.99999999,"d":"43,520,000"}]
["built_t","T 1800 x 44, 200 x 40",1800,44,200,40,79200,{"v":794.2464820888023,"d":"794.2"},1800,44,200,40,87200,{"v":0.15957446808510634,"d":"16%"},{"v":54960000,"d":"54,960,000"}]
["built_t","T 2000 x 50, 200 x 41",2000,50,200,41,100000,{"v":774.4353453473582,"d":"774.4"},2000,50,200,41,108200,{"v":0.24082568807339455,"d":"24%"},{"v":70933333.33333333,"d":"70,933,333"}]
["built_t","T 2200 x 55, 200 x 42",2200,55,200,42,121000,{"v":773.0012058189371,"d":"773.0"},2200,55,200,42,129400,{"v":0.1959334565619224,"d":"20%"},{"v":88953333.33333333,"d":"88,953,333"}]
[null,"outside range",{"$nulls":6},10000,100,100,100]

{"sheet":"fort","index":13,"n_rows":253,"n_cols":15,"rows_kept":253}
[]
[null,null,"h","tw",null,null,"A",null,"hw","tw",null,null,"A"]
[{"$nulls":8},"mm","mm"]
["flat","F 60 x 5",60,6,{"v":227.68399153212331,"d":"228"},{"$f":"C4*D4","v":360},null,{"$f":"C4*SQRT(360)/(D4-1)","v":227.68399153212331},{"$f":"C4","v":60},{"$f":"D4","v":6},0,0,360]
["flat","F 60 x 6",60,7,{"v":189.73665961010278,"d":"190"},{"$f":"C5*D5","v":420},null,189.73665961010275,60,7,0,0,420,{"$f":"M5/M4-1","v":{"v":0.16666666666666674,"d":"17%"}}]
["flat","F 60 x 7",60,8,{"v":162.63142252294523,"d":"163"},{"$f":"C6*D6","v":480},null,162.63142252294523,60,8,0,0,480,{"$f":"M6/M5-1","v":{"v":0.1428571428571428,"d":"14%"}}]
["flat","F 80 x 6",80,7,{"v":243.947133784418,"d":"244"},{"$f":"C7*D7","v":560},null,252.98221281347037,80,7,0,0,560,{"v":0.16666666666666674,"d":"17%"}]
["flat","F 80 x 7",80,8,{"v":216.8418966972603,"d":"217"},{"$f":"C8*D8","v":640},null,216.84189669726032,80,8,0,0,640,{"v":0.1428571428571428,"d":"14%"}]
["built_t",{"$f":"CONCATENATE(\"T \",C9,\" x \",D9, \", \",E9,\" x \",F9)","v":"T 80 x 5, 50 x 5"},80,5,{"$f":"C9/2+10","v":50},{"$f":"D9","v":5},{"$f":"C9*D9+E9*F9","v":650},{"v":379.47331922020555,"d":"379.5"},80,5,{"$f":"E9","v":50},{"$f":"F9","v":5},{"$f":"I9*J9+K9*L9","v":650},{"v":0.015625,"d":"2%"},{"$f":"1/6*I9*(4*K9*L9+J9*I9+40*I9)","v":{"v":61333.33333333333,"d":"61,333"}}]
["flat","F 80 x 8",80,9,{"v":189.73665961010278,"d":"190"},{"$f":"C10*D10","v":720},null,189.73665961010278,80,9,0,0,720,{"v":0.10769230769230775,"d":"11%"}]
["built_t",{"$f":"CONCATENATE(\"T \",C11,\" x \",D11, \", \",E11,\" x \",F11)","v":"T 80 x 6, 50 x 6"},80,6,{"$f":"C11/2+10","v":50},{"$f":"D11","v":6},{"$f":"C11*D11+E11*F11","v":780},{"v":303.5786553761644,"d":"303.6"},80,6,{"$f":"E11","v":50},{"$f":"F11","v":6},{"$f":"I11*J11+K11*L11","v":780},{"v":0.08333333333333326,"d":"8%"},{"$f":"1/6*I11*(4*K11*L11+J11*I11+40*I11)","v":{"v":65066.666666666664,"d":"65,067"}}]
["flat","F 80 x 9",100,8,{"v":271.05237087157536,"d":"271"},{"$f":"C12*D12","v":800},null,271.05237087157536,100,8,0,0,800,{"v":0.02564102564102555,"d":"3%"}]
["flat","F 100 x 7",80,10,{"v":168.65480854231356,"d":"169"},{"$f":"C13*D13","v":800},null,168.6548085423136,80,10,0,0,800,{"v":0,"d":"0%"}]
["flat","F 100 x 8",100,9,{"v":237.17082451262846,"d":"237"},{"$f":"C14*D14","v":900},null,237.17082451262846,100,9,0,0,900,{"v":0.125,"d":"13%"}]
["built_t",{"$f":"CONCATENATE(\"T \",C15,\" x \",D15, \", \",E15,\" x \",F15)","v":"T 80 x 7, 50 x 7"},80,7,{"$f":"C15/2+10","v":50},{"$f":"D15","v":7},{"$f":"C15*D15+E15*F15","v":910},{"v":252.98221281347037,"d":"253.0"},80,7,{"$f":"E15","v":50},{"$f":"F15","v":7},{"$f":"I15*J15+K15*L15","v":910},{"v":0.011111111111111072,"d":"1%"},{"$f":"1/6*I15*(4*K15*L15+J15*I15+40*I15)","v":{"v":68800,"d":"68,800"}}]
["built_t",{"$f":"CONCATENATE(\"T \",C16,\" x \",D16, \", \",E16,\" x \",F16)","v":"T 100 x 6, 60 x 6"},100,6,{"$f":"C16/2+10","v":60},{"$f":"D16","v":6},{"$f":"C16*D16+E16*F16","v":960},{"v":379.47331922020555,"d":"379.5"},100,6,{"$f":"E16","v":60},{"$f":"F16","v":6},{"$f":"I16*J16+K16*L16","v":960},{"v":0.05494505494505497,"d":"5%"},{"$f":"1/6*I16*(4*K16*L16+J16*I16+40*I16)","v":{"v":100666.66666666666,"d":"100,667"}}]
["flat","F 100 x 9",100,10,{"v":210.81851067789196,"d":"211"},{"$f":"C17*D17","v":1000},null,210.81851067789196,100,10,0,0,1000,{"v":0.04166666666666674,"d":"4%"}]
["built_t",{"$f":"CONCATENATE(\"T \",C18,\" x \",D18, \", \",E18,\" x \",F18)","v":"T 80 x 8, 50 x 8"},80,8,{"$f":"C18/2+10","v":50},{"$f":"D18","v":8},{"$f":"C18*D18+E18*F18","v":1040},{"v":216.84189669726032,"d":"216.8"},80,8,{"$f":"E18","v":50},8,{"$f":"I18*J18+K18*L18","v":1040},{"v":0.040000000000000036,"d":"4%"},{"$f":"1/6*I18*(4*K18*L18+J18*I18+40*I18)","v":{"v":72533.33333333333,"d":"72,533"}}]
["built_t",{"$f":"CONCATENATE(\"T \",C19,\" x \",D19, \", \",E19,\" x \",F19)","v":"T 100 x 7, 60 x 7"},100,7,{"$f":"C19/2+10","v":60},{"$f":"D19","v":7},{"$f":"C19*D19+E19*F19","v":1120},{"v":316.22776601683796,"d":"316.2"},100,7,60,7,{"$f":"I19*J19+K19*L19","v":1120},{"v":0.07692307692307687,"d":"8%"},{"$f":"1/6*I19*(4*K19*L19+J19*I19+40*I19)","v":{"v":106333.33333333331,"d":"106,333"}}]
["built_t",{"$f":"CONCATENATE(\"T \",C20,\" x \",D20, \", \",E20,\" x \",F20)","v":"T 120 x 6, 70 x 6"},120,6,{"$f":"C20/2+10","v":70},{"$f":"D20","v":6},{"$f":"C20*D20+E20*F20","v":1140},{"v":455.36798306424663,"d":"455.4"},120,6,70,6,{"$f":"I20*J20+K20*L20","v":1140},{"v":0.017857142857142794,"d":"2%"},{"$f":"1/6*I20*(4*K20*L20+J20*I20+40*I20)","v":{"v":144000,"d":"144,000"}}]
["built_t",{"$f":"CONCATENATE(\"T \",C21,\" x \",D21, \", \",E21,\" x \",F21)","v":"T 80 x 9, 50 x 9"},80,9,{"$f":"C21/2+10","v":50},{"$f":"D21","v":9},{"$f":"C21*D21+E21*F21","v":1170},{"v":189.73665961010278,"d":"189.7"},80,9,50,9,{"$f":"I21*J21+K21*L21","v":1170},{"v":0.026315789473684292,"d":"3%"},{"$f":"1/6*I21*(4*K21*L21+J21*I21+40*I21)","v":{"v":76266.66666666666,"d":"76,267"}}]
["flat","F 120 x 9",120,10,{"v":252.98221281347037,"d":"253"},{"$f":"C22*D22","v":1200},null,252.98221281347034,120,10,0,0,1200,{"v":0.02564102564102555,"d":"3%"}]
["built_t",{"$f":"CONCATENATE(\"T \",C23,\" x \",D23, \", \",E23,\" x \",F23)","v":"T 100 x 8, 60 x 8"},100,8,{"$f":"C23/2+10","v":60},{"$f":"D23","v":8},{"$f":"C23*D23+E23*F23","v":1280},{"v":271.05237087157536,"d":"271.1"},100,8,{"$f":"E23","v":60},{"$f":"F23","v":8},{"$f":"I23*J23+K23*L23","v":1280},{"v":0.06666666666666665,"d":"7%"},{"$f":"1/6*I23*(4*K23*L23+J23*I23+40*I23)","v":{"v":111999.99999999999,"d":"112,000"}}]
["built_t",{"$f":"CONCATENATE(\"T \",C24,\" x \",D24, \", \",E24,\" x \",F24)","v":"T 80 x 10, 50 x 10"},80,10,{"$f":"C24/2+10","v":50},{"$f":"D24","v":10},{"$f":"C24*D24+E24*F24","v":1300},{"v":168.6548085423136,"d":"168.7"},80,10,{"$f":"E24","v":50},{"$f":"F24","v":10},{"$f":"I24*J24+K24*L24","v":1300},{"v":0.015625,"d":"2%"},{"$f":"1/6*I24*(4*K24*L24+J24*I24+40*I24)","v":{"v":80000,"d":"80,000"}}]
["flat","F 120 x 10",120,11,{"v":227.68399153212331,"d":"228"},{"$f":"C25*D25","v":1320},null,227.68399153212331,120,11,0,0,1320,{"v":0.01538461538461533,"d":"2%"}]
["built_t",{"$f":"CONCATENATE(\"T \",C26,\" x \",D26, \", \",E26,\" x \",F26)","v":"T 140 x 6, 80 x 6"},140,6,{"$f":"C26/2+10","v":80},{"$f":"D26","v":6},{"$f":"C26*D26+E26*F26","v":1320},{"v":531.2626469082877,"d":"531.3"},140,6,{"$f":"E26","v":80},{"$f":"F26","v":6},{"$f":"I26*J26+K26*L26","v":1320},{"v":0,"d":"0%"},{"$f":"1/6*I26*(4*K26*L26+J26*I26+40*I26)","v":{"v":195066.66666666666,"d":"195,067"}}]
["built_t",{"$f":"CONCATENATE(\"T \",C27,\" x \",D27, \", \",E27,\" x \",F27)","v":"T 120 x 7, 70 x 7"},120,7,{"$f":"C27/2+10","v":70},{"$f":"D27","v":7},{"$f":"C27*D27+E27*F27","v":1330},{"v":379.4733192202055,"d":"379.5"},120,7,{"$f":"E27","v":70},{"$f":"F27","v":7},{"$f":"I27*J27+K27*L27","v":1330},{"v":7.575757575757569E-3,"d":"1%"},{"$f":"1/6*I27*(4*K27*L27+J27*I27+40*I27)","v":{"v":152000,"d":"152,000"}}]
["flat","F 120 x 11",120,12,{"v":206.98544684738482,"d":"207"},{"$f":"C28*D28","v":1440},null,206.98544684738482,120,12,0,0,1440,{"v":0.08270676691729317,"d":"8%"}]
["built_t",{"$f":"CONCATENATE(\"T \",C29,\" x \",D29, \", \",E29,\" x \",F29)","v":"T 160 x 6, 90 x 6"},160,6,{"$f":"C29/2+10","v":90},{"$f":"D29","v":6},{"$f":"C29*D29+E29*F29","v":1500},{"v":607.1573107523288,"d":"607.2"},160,6,{"$f":"E29","v":90},{"$f":"F29","v":6},{"$f":"I29*J29+K29*L29","v":1500},{"v":0.04166666666666674,"d":"4%"},{"$f":"1/6*I29*(4*K29*L29+J29*I29+40*I29)","v":{"v":253866.66666666666,"d":"253,867"}}]
["built_t",{"$f":"CONCATENATE(\"T \",C30,\" x \",D30, \", \",E30,\" x \",F30)","v":"T 120 x 8, 70 x 8"},120,8,{"$f":"C30/2+10","v":70},{"$f":"D30","v":8},{"$f":"C30*D30+E30*F30","v":1520},{"v":325.26284504589046,"d":"325.3"},120,8,{"$f":"E30","v":70},{"$f":"F30","v":8},{"$f":"I30*J30+K30*L30","v":1520},{"v":0.01333333333333342,"d":"1%"},{"$f":"1/6*I30*(4*K30*L30+J30*I30+40*I30)","v":{"v":160000,"d":"160,000"}}]
["flat","F 140 x 10",140,11,{"v":265.63132345414385,"d":"266"},{"$f":"C31*D31","v":1540},null,265.63132345414385,140,11,0,0,1540,{"v":0.013157894736842035,"d":"1%"}]
["built_t",{"$f":"CONCATENATE(\"T \",C32,\" x \",D32, \", \",E32,\" x \",F32)","v":"T 140 x 7, 80 x 7"},140,7,{"$f":"C32/2+10","v":80},{"$f":"D32","v":7},{"$f":"C32*D32+E32*F32","v":1540},{"v":442.71887242357315,"d":"442.7"},140,7,{"$f":"E32","v":80},{"$f":"F32","v":7},{"$f":"I32*J32+K32*L32","v":1540},{"v":0,"d":"0%"},{"$f":"1/6*I32*(4*K32*L32+J32*I32+40*I32)","v":{"v":205800,"d":"205,800"}}]
["flat","F 140 x 11",140,12,{"v":241.48302132194897,"d":"241"},{"$f":"C33*D33","v":1680},null,241.48302132194897,140,12,0,0,1680,{"v":0.09090909090909083,"d":"9%"}]
["built_t",{"$f":"CONCATENATE(\"T \",C34,\" x \",D34, \", \",E34,\" x \",F34)","v":"T 160 x 7, 90 x 7"},160,7,{"$f":"C34/2+10","v":90},{"$f":"D34","v":7},{"$f":"C34*D34+E34*F34","v":1750},{"v":505.96442562694074,"d":"506.0"},160,7,{"$f":"E34","v":90},{"$f":"F34","v":7},{"$f":"I34*J34+K34*L34","v":1750},{"v":0.04166666666666674,"d":"4%"},{"$f":"1/6*I34*(4*K34*L34+J34*I34+40*I34)","v":{"v":267733.3333333333,"d":"267,733"}}]
["built_t",{"$f":"CONCATENATE(\"T \",C35,\" x \",D35, \", \",E35,\" x \",F35)","v":"T 140 x 8, 80 x 8"},140,8,{"$f":"C35/2+10","v":80},{"$f":"D35","v":8},{"$f":"C35*D35+E35*F35","v":1760},{"v":379.47331922020555,"d":"379.5"},140,8,{"$f":"E35","v":80},{"$f":"F35","v":8},{"$f":"I35*J35+K35*L35","v":1760},{"v":0.005714285714285783,"d":"1%"},{"$f":"1/6*I35*(4*K35*L35+J35*I35+40*I35)","v":{"v":216533.3333333333,"d":"216,533"}}]
["flat","F 140 x 12",140,13,{"v":221.35943621178654,"d":"221"},{"$f":"C36*D36","v":1820},null,221.35943621178657,140,13,0,0,1820,{"v":0.03409090909090917,"d":"3%"}]
["flat","F 140 x 13",160,12,{"v":275.9805957965131,"d":"276"},{"$f":"C37*D37","v":1920},null,275.9805957965131,160,12,0,0,1920,{"v":0.05494505494505497,"d":"5%"}]
["flat","F 160 x 11",140,14,{"v":204.33178727241838,"d":"204"},{"$f":"C38*D38","v":1960},null,204.33178727241835,140,14,0,0,1960,{"v":0.02083333333333326,"d":"2%"}]
["built_t",{"$f":"CONCATENATE(\"T \",C39,\" x \",D39, \", \",E39,\" x \",F39)","v":"T 180 x 7, 100 x 7"},180,7,{"$f":"C39/2+10","v":100},{"$f":"D39","v":7},{"$f":"C39*D39+E39*F39","v":1960},{"v":569.2099788303083,"d":"569.2"},180,7,{"$f":"E39","v":100},7,{"$f":"I39*J39+K39*L39","v":1960},{"v":0,"d":"0%"},{"$f":"1/6*I39*(4*K39*L39+J39*I39+40*I39)","v":{"v":337800,"d":"337,800"}}]
["built_t",{"$f":"CONCATENATE(\"T \",C40,\" x \",D40, \", \",E40,\" x \",F40)","v":"T 140 x 9, 80 x 9"},140,9,{"$f":"C40/2+10","v":80},{"$f":"D40","v":9},{"$f":"C40*D40+E40*F40","v":1980},{"v":332.03915431767985,"d":"332.0"},140,9,80,9,{"$f":"I40*J40+K40*L40","v":1980},{"v":0.010204081632652962,"d":"1%"},{"$f":"1/6*I40*(4*K40*L40+J40*I40+40*I40)","v":{"v":227266.66666666666,"d":"227,267"}}]
["built_t",{"$f":"CONCATENATE(\"T \",C41,\" x \",D41, \", \",E41,\" x \",F41)","v":"T 160 x 8, 90 x 8"},160,8,{"$f":"C41/2+10","v":90},{"$f":"D41","v":8},{"$f":"C41*D41+E41*F41","v":2000},{"v":433.68379339452065,"d":"433.7"},160,8,90,8,{"$f":"I41*J41+K41*L41","v":2000},{"v":0.010101010101010166,"d":"1%"},{"$f":"1/6*I41*(4*K41*L41+J41*I41+40*I41)","v":{"v":281600,"d":"281,600"}}]
["flat","F 160 x 12",160,13,{"v":252.98221281347037,"d":"253"},{"$f":"C42*D42","v":2080},null,252.98221281347037,160,13,0,0,2080,{"v":0.040000000000000036,"d":"4%"}]
["built_t",{"$f":"CONCATENATE(\"T \",C43,\" x \",D43, \", \",E43,\" x \",F43)","v":"T 200 x 7, 110 x 7"},200,7,{"$f":"C43/2+10","v":110},{"$f":"D43","v":7},{"$f":"C43*D43+E43*F43","v":2170},{"v":632.4555320336759,"d":"632.5"},200,7,{"$f":"E43","v":110},{"$f":"F43","v":7},{"$f":"I43*J43+K43*L43","v":2170},{"v":0.04326923076923084,"d":"4%"},{"$f":"1/6*I43*(4*K43*L43+J43*I43+40*I43)","v":{"v":415999.99999999994,"d":"416,000"}}]
["flat","F 160 x 13",160,14,{"v":233.52204259704956,"d":"234"},{"$f":"C44*D44","v":2240},null,233.52204259704956,160,14,0,0,2240,{"v":0.032258064516129004,"d":"3%"}]
["built_t",{"$f":"CONCATENATE(\"T \",C45,\" x \",D45, \", \",E45,\" x \",F45)","v":"T 200 x 8, 110 x 8"},200,8,{"$f":"C45/2+10","v":110},{"$f":"D45","v":8},{"$f":"C45*D45+E45*F45","v":2480},{"v":542.1047417431507,"d":"542.1"},200,8,{"$f":"E45","v":110},{"$f":"F45","v":8},{"$f":"I45*J45+K45*L45","v":2480},{"v":0.1071428571428572,"d":"11%"},{"$f":"1/6*I45*(4*K45*L45+J45*I45+40*I45)","v":{"v":437333.33333333326,"d":"437,333"}}]
["flat","F 180 x 13",180,14,{"v":262.7122979216808,"d":"263"},{"$f":"C46*D46","v":2520},null,262.7122979216807,180,14,0,0,2520,{"v":0.016129032258064502,"d":"2%"}]
["built_t",{"$f":"CONCATENATE(\"T \",C47,\" x \",D47, \", \",E47,\" x \",F47)","v":"T 180 x 9, 100 x 9"},180,9,{"$f":"C47/2+10","v":100},{"$f":"D47","v":9},{"$f":"C47*D47+E47*F47","v":2520},{"v":426.9074841227312,"d":"426.9"},180,9,{"$f":"E47","v":100},{"$f":"F47","v":9},{"$f":"I47*J47+K47*L47","v":2520},{"v":0,"d":"0%"},{"$f":"1/6*I47*(4*K47*L47+J47*I47+40*I47)","v":{"v":372600,"d":"372,600"}}]
["flat","F 180 x 14",180,15,{"v":243.94713378441784,"d":"244"},{"$f":"C48*D48","v":2700},null,243.94713378441784,180,15,0,0,2700,{"v":0.0714285714285714,"d":"7%"}]
["built_t",{"$f":"CONCATENATE(\"T \",C49,\" x \",D49, \", \",E49,\" x \",F49)","v":"T 220 x 8, 120 x 8"},220,8,{"$f":"C49/2+10","v":120},{"$f":"D49","v":8},{"$f":"C49*D49+E49*F49","v":2720},{"v":596.3152159174658,"d":"596.3"},220,8,{"$f":"E49","v":120},8,{"$f":"I49*J49+K49*L49","v":2720},{"v":0.007407407407407307,"d":"1%"},{"$f":"1/6*I49*(4*K49*L49+J49*I49+40*I49)","v":{"v":528000,"d":"528,000"}}]
["built_t",{"$f":"CONCATENATE(\"T \",C50,\" x \",D50, \", \",E50,\" x \",F50)","v":"T 200 x 9, 110 x 9"},200,9,{"$f":"C50/2+10","v":110},{"$f":"D50","v":9},{"$f":"C50*D50+E50*F50","v":2790},{"v":474.3416490252569,"d":"474.3"},200,9,110,9,{"$f":"I50*J50+K50*L50","v":2790},{"v":0.025735294117646967,"d":"3%"},{"$f":"1/6*I50*(4*K50*L50+J50*I50+40*I50)","v":{"v":458666.6666666666,"d":"458,667"}}]
["built_t",{"$f":"CONCATENATE(\"T \",C51,\" x \",D51, \", \",E51,\" x \",F51)","v":"T 180 x 10, 100 x 10"},180,10,{"$f":"C51/2+10","v":100},{"$f":"D51","v":10},{"$f":"C51*D51+E51*F51","v":2800},{"v":379.4733192202055,"d":"379.5"},180,10,100,10,{"$f":"I51*J51+K51*L51","v":2800},{"v":3.5842293906809264E-3,"d":"0%"},{"$f":"1/6*I51*(4*K51*L51+J51*I51+40*I51)","v":{"v":390000,"d":"390,000"}}]
["flat","F 180 x 15",180,16,{"v":227.68399153212331,"d":"228"},{"$f":"C52*D52","v":2880},null,227.68399153212331,180,16,0,0,2880,{"v":0.02857142857142847,"d":"3%"}]
["flat","F 200 x 14",200,15,{"v":271.05237087157536,"d":"271"},{"$f":"C53*D53","v":3000},null,271.05237087157536,200,15,0,0,3000,{"v":0.04166666666666674,"d":"4%"}]
["built_t",{"$f":"CONCATENATE(\"T \",C54,\" x \",D54, \", \",E54,\" x \",F54)","v":"T 220 x 9, 120 x 9"},220,9,{"$f":"C54/2+10","v":120},{"$f":"D54","v":9},{"$f":"C54*D54+E54*F54","v":3060},{"v":521.7758139277826,"d":"521.8"},220,9,{"$f":"E54","v":120},9,{"$f":"I54*J54+K54*L54","v":3060},{"v":0.020000000000000018,"d":"2%"},{"$f":"1/6*I54*(4*K54*L54+J54*I54+40*I54)","v":{"v":553666.6666666666,"d":"553,667"}}]
["built_t",{"$f":"CONCATENATE(\"T \",C55,\" x \",D55, \", \",E55,\" x \",F55)","v":"T 180 x 11, 100 x 11"},180,11,{"$f":"C55/2+10","v":100},{"$f":"D55","v":11},{"$f":"C55*D55+E55*F55","v":3080},{"v":341.525987298185,"d":"341.5"},180,11,100,11,{"$f":"I55*J55+K55*L55","v":3080},{"v":0.006535947712418277,"d":"1%"},{"$f":"1/6*I55*(4*K55*L55+J55*I55+40*I55)","v":{"v":407400,"d":"407,400"}}]
["built_t",{"$f":"CONCATENATE(\"T \",C56,\" x \",D56, \", \",E56,\" x \",F56)","v":"T 200 x 10, 110 x 10"},200,10,{"$f":"C56/2+10","v":110},{"$f":"D56","v":10},{"$f":"C56*D56+E56*F56","v":3100},{"v":421.63702135578393,"d":"421.6"},200,10,110,10,{"$f":"I56*J56+K56*L56","v":3100},{"v":0.006493506493506551,"d":"1%"},{"$f":"1/6*I56*(4*K56*L56+J56*I56+40*I56)","v":{"v":479999.99999999994,"d":"480,000"}}]
["flat","F 200 x 15",200,16,{"v":252.98221281347037,"d":"253"},{"$f":"C57*D57","v":3200},null,252.98221281347034,200,16,0,0,3200,{"v":0.032258064516129004,"d":"3%"}]
["built_t",{"$f":"CONCATENATE(\"T \",C58,\" x \",D58, \", \",E58,\" x \",F58)","v":"T 240 x 9, 130 x 9"},240,9,{"$f":"C58/2+10","v":130},{"$f":"D58","v":9},{"$f":"C58*D58+E58*F58","v":3330},{"v":569.2099788303083,"d":"569.2"},240,9,{"$f":"E58","v":130},{"$f":"F58","v":9},{"$f":"I58*J58+K58*L58","v":3330},{"v":0.04062499999999991,"d":"4%"},{"$f":"1/6*I58*(4*K58*L58+J58*I58+40*I58)","v":{"v":657600,"d":"657,600"}}]
["built_t",{"$f":"CONCATENATE(\"T \",C59,\" x \",D59, \", \",E59,\" x \",F59)","v":"T 180 x 12, 100 x 12"},180,12,{"$f":"C59/2+10","v":100},{"$f":"D59","v":12},{"$f":"C59*D59+E59*F59","v":3360},{"v":310.47817027107726,"d":"310.5"},180,12,{"$f":"E59","v":100},{"$f":"F59","v":12},{"$f":"I59*J59+K59*L59","v":3360},{"v":9.009009009008917E-3,"d":"1%"},{"$f":"1/6*I59*(4*K59*L59+J59*I59+40*I59)","v":{"v":424800,"d":"424,800"}}]
["flat","F 200 x 16",200,17,{"v":237.17082451262846,"d":"237"},{"$f":"C60*D60","v":3400},null,237.17082451262846,200,17,0,0,3400,{"v":0.011904761904761862,"d":"1%"}]
["built_t",{"$f":"CONCATENATE(\"T \",C61,\" x \",D61, \", \",E61,\" x \",F61)","v":"T 220 x 10, 120 x 10"},220,10,{"$f":"C61/2+10","v":120},{"$f":"D61","v":10},{"$f":"C61*D61+E61*F61","v":3400},{"v":463.8007234913623,"d":"463.8"},220,10,{"$f":"E61","v":120},{"$f":"F61","v":10},{"$f":"I61*J61+K61*L61","v":3400},{"v":0,"d":"0%"},{"$f":"1/6*I61*(4*K61*L61+J61*I61+40*I61)","v":{"v":579333.3333333333,"d":"579,333"}}]
["built_t",{"$f":"CONCATENATE(\"T \",C62,\" x \",D62, \", \",E62,\" x \",F62)","v":"T 200 x 11, 110 x 11"},200,11,{"$f":"C62/2+10","v":110},{"$f":"D62","v":11},{"$f":"C62*D62+E62*F62","v":3410},{"v":379.47331922020555,"d":"379.5"},200,11,{"$f":"E62","v":110},{"$f":"F62","v":11},{"$f":"I62*J62+K62*L62","v":3410},{"v":0.002941176470588225,"d":"0%"},{"$f":"1/6*I62*(4*K62*L62+J62*I62+40*I62)","v":{"v":501333.33333333326,"d":"501,333"}}]
["flat","F 220 x 16",220,16,{"v":278.2804340948174,"d":"278"},{"$f":"C63*D63","v":3520},null,278.2804340948174,220,16,0,0,3520,{"v":0.032258064516129004,"d":"3%"}]
["flat","F 220 x 15",200,18,{"v":223.21959954129738,"d":"223"},{"$f":"C64*D64","v":3600},null,223.21959954129738,200,18,0,0,3600,{"v":0.022727272727272707,"d":"2%"}]
["built_t",{"$f":"CONCATENATE(\"T \",C65,\" x \",D65, \", \",E65,\" x \",F65)","v":"T 240 x 10, 130 x 10"},240,10,{"$f":"C65/2+10","v":130},{"$f":"D65","v":10},{"$f":"C65*D65+E65*F65","v":3700},{"v":505.9644256269407,"d":"506.0"},240,10,{"$f":"E65","v":130},{"$f":"F65","v":10},{"$f":"I65*J65+K65*L65","v":3700},{"v":0.02777777777777768,"d":"3%"},{"$f":"1/6*I65*(4*K65*L65+J65*I65+40*I65)","v":{"v":688000,"d":"688,000"}}]
["built_t",{"$f":"CONCATENATE(\"T \",C66,\" x \",D66, \", \",E66,\" x \",F66)","v":"T 200 x 12, 110 x 12"},200,12,{"$f":"C66/2+10","v":110},{"$f":"D66","v":12},{"$f":"C66*D66+E66*F66","v":3720},{"v":344.9757447456414,"d":"345.0"},200,12,{"$f":"E66","v":110},{"$f":"F66","v":12},{"$f":"I66*J66+K66*L66","v":3720},{"v":0.00540540540540535,"d":"1%"},{"$f":"1/6*I66*(4*K66*L66+J66*I66+40*I66)","v":{"v":522666.66666666657,"d":"522,667"}}]
["flat","F 200 x 18",220,17,{"v":260.8879069638913,"d":"261"},{"$f":"C67*D67","v":3740},null,260.8879069638913,220,17,0,0,3740,{"v":0.005376344086021501,"d":"1%"}]
["built_t",{"$f":"CONCATENATE(\"T \",C68,\" x \",D68, \", \",E68,\" x \",F68)","v":"T 220 x 11, 120 x 11"},220,11,{"$f":"C68/2+10","v":120},{"$f":"D68","v":11},{"$f":"C68*D68+E68*F68","v":3740},{"$f":"C68*SQRT(360)/(D68-1)","v":{"v":417.42065114222606,"d":"417.4"}},{"$f":"C68","v":220},{"$f":"D68","v":11},{"$f":"E68","v":120},{"$f":"F68","v":11},{"$f":"I68*J68+K68*L68","v":3740},{"v":0,"d":"0%"},{"$f":"1/6*I68*(4*K68*L68+J68*I68+40*I68)","v":{"v":605000,"d":"605,000"}}]
["flat","F 200 x 17",200,19,{"v":210.81851067789196,"d":"211"},{"$f":"C69*D69","v":3800},null,210.81851067789196,200,19,0,0,3800,{"v":0.016042780748663166,"d":"2%"}]
["flat","F 220 x 17",220,18,{"v":245.5415594954271,"d":"246"},{"$f":"C70*D70","v":3960},null,245.5415594954271,220,18,0,0,3960,{"$f":"M70/M69-1","v":{"v":0.042105263157894646,"d":"4%"}}]
["built_t",{"$f":"CONCATENATE(\"T \",C71,\" x \",D71, \", \",E71,\" x \",F71)","v":"T 260 x 10, 140 x 10"},260,10,{"$f":"C71/2+10","v":140},{"$f":"D71","v":10},{"$f":"C71*D71+E71*F71","v":4000},{"v":548.1281277625191,"d":"548.1"},260,10,{"$f":"E71","v":140},{"$f":"F71","v":10},{"$f":"I71*J71+K71*L71","v":4000},{"v":0.010101010101010166,"d":"1%"},{"$f":"1/6*I71*(4*K71*L71+J71*I71+40*I71)","v":{"v":805999.9999999999,"d":"806,000"}}]
["built_t",{"$f":"CONCATENATE(\"T \",C72,\" x \",D72, \", \",E72,\" x \",F72)","v":"T 240 x 11, 130 x 11"},240,11,{"$f":"C72/2+10","v":130},{"$f":"D72","v":11},{"$f":"C72*D72+E72*F72","v":4070},{"v":455.36798306424663,"d":"455.4"},240,11,{"$f":"E72","v":130},{"$f":"F72","v":11},{"$f":"I72*J72+K72*L72","v":4070},{"v":0.01750000000000007,"d":"2%"},{"$f":"1/6*I72*(4*K72*L72+J72*I72+40*I72)","v":{"v":718400,"d":"718,400"}}]
["flat","F 220 x 18",220,19,{"v":231.90036174568115,"d":"232"},{"$f":"C73*D73","v":4180},null,231.90036174568115,220,19,0,0,4180,{"v":0.027027027027026973,"d":"3%"}]
["built_t",{"$f":"CONCATENATE(\"T \",C74,\" x \",D74, \", \",E74,\" x \",F74)","v":"T 280 x 10, 150 x 10"},280,10,{"$f":"C74/2+10","v":150},{"$f":"D74","v":10},{"$f":"C74*D74+E74*F74","v":4300},{"v":590.2918298980975,"d":"590.3"},280,10,{"$f":"E74","v":150},{"$f":"F74","v":10},{"$f":"I74*J74+K74*L74","v":4300},{"v":0.028708133971291794,"d":"3%"},{"$f":"1/6*I74*(4*K74*L74+J74*I74+40*I74)","v":{"v":933333.3333333333,"d":"933,333"}}]
["flat","F 240 x 17",240,18,{"v":267.86351944955686,"d":"268"},{"$f":"C75*D75","v":4320},null,267.86351944955686,240,18,0,0,4320,{"v":4.6511627906977715E-3,"d":"0%"}]
["built_t",{"$f":"CONCATENATE(\"T \",C76,\" x \",D76, \", \",E76,\" x \",F76)","v":"T 260 x 11, 140 x 11"},260,11,{"$f":"C76/2+10","v":140},{"$f":"D76","v":11},{"$f":"C76*D76+E76*F76","v":4400},{"v":493.3153149862672,"d":"493.3"},260,11,{"$f":"E76","v":140},{"$f":"F76","v":11},{"$f":"I76*J76+K76*L76","v":4400},{"v":0.0185185185185186,"d":"2%"},{"$f":"1/6*I76*(4*K76*L76+J76*I76+40*I76)","v":{"v":841533.3333333333,"d":"841,533"}}]
["flat","F 240 x 18",240,19,{"v":252.98221281347037,"d":"253"},{"$f":"C77*D77","v":4560},null,252.98221281347034,240,19,0,0,4560,{"v":0.036363636363636376,"d":"4%"}]
["built_t",{"$f":"CONCATENATE(\"T \",C78,\" x \",D78, \", \",E78,\" x \",F78)","v":"T 280 x 11, 150 x 11"},280,11,{"$f":"C78/2+10","v":150},{"$f":"D78","v":11},{"$f":"C78*D78+E78*F78","v":4730},{"v":531.2626469082877,"d":"531.3"},280,11,{"$f":"E78","v":150},{"$f":"F78","v":11},{"$f":"I78*J78+K78*L78","v":4730},{"v":0.037280701754385914,"d":"4%"},{"$f":"1/6*I78*(4*K78*L78+J78*I78+40*I78)","v":{"v":974400,"d":"974,400"}}]
["built_t",{"$f":"CONCATENATE(\"T \",C79,\" x \",D79, \", \",E79,\" x \",F79)","v":"T 260 x 12, 140 x 12"},260,12,{"$f":"C79/2+10","v":140},{"$f":"D79","v":12},{"$f":"C79*D79+E79*F79","v":4800},{"v":448.4684681693338,"d":"448.5"},260,12,{"$f":"E79","v":140},{"$f":"F79","v":12},{"$f":"I79*J79+K79*L79","v":4800},{"v":0.014799154334038,"d":"1%"},{"$f":"1/6*I79*(4*K79*L79+J79*I79+40*I79)","v":{"v":877066.6666666666,"d":"877,067"}}]
["flat","F 260 x 18",260,19,{"v":274.06406388125953,"d":"274"},{"$f":"C80*D80","v":4940},null,274.06406388125953,260,19,0,0,4940,{"v":0.029166666666666563,"d":"3%"}]
["built_t",{"$f":"CONCATENATE(\"T \",C81,\" x \",D81, \", \",E81,\" x \",F81)","v":"T 280 x 12, 150 x 12"},280,12,{"$f":"C81/2+10","v":150},{"$f":"D81","v":12},{"$f":"C81*D81+E81*F81","v":5160},{"v":482.96604264389794,"d":"483.0"},280,12,{"$f":"E81","v":150},{"$f":"F81","v":12},{"$f":"I81*J81+K81*L81","v":5160},{"v":0.044534412955465674,"d":"4%"},{"$f":"1/6*I81*(4*K81*L81+J81*I81+40*I81)","v":{"v":1015466.6666666666,"d":"1,015,467"}}]
["built_t",{"$f":"CONCATENATE(\"T \",C82,\" x \",D82, \", \",E82,\" x \",F82)","v":"T 281 x 12, 150.5 x 12"},281,12,{"$f":"C82/2+10","v":{"v":150.5,"d":"151"}},{"$f":"D82","v":12},{"$f":"C82*D82+E82*F82","v":5178},{"v":484.6909213676261,"d":"484.7"},281,12,{"$f":"E82","v":150.5},{"$f":"F82","v":12},{"$f":"I82*J82+K82*L82","v":5178},{"v":3.4883720930232176E-3,"d":"0%"},{"$f":"1/6*I82*(4*K82*L82+J82*I82+40*I82)","v":{"v":1022652.6666666665,"d":"1,022,653"}}]
["flat","F 260 x 19",260,20,{"v":259.6396394664564,"d":"260"},{"$f":"C83*D83","v":5200},null,259.6396394664564,260,20,0,0,5200,{"v":0.004248744689069106,"d":"0%"}]
["flat","F 260 x 20",260,21,{"v":246.6576574931336,"d":"247"},{"$f":"C84*D84","v":5460},null,246.6576574931336,260,21,0,0,5460,{"v":0.050000000000000044,"d":"5%"}]
["built_t",{"$f":"CONCATENATE(\"T \",C85,\" x \",D85, \", \",E85,\" x \",F85)","v":"T 300 x 12, 160 x 12"},300,12,{"$f":"C85/2+10","v":160},{"$f":"D85","v":12},{"$f":"C85*D85+E85*F85","v":5520},{"v":517.4636171184621,"d":"517.5"},300,12,{"$f":"E85","v":160},{"$f":"F85","v":12},{"$f":"I85*J85+K85*L85","v":5520},{"v":0.01098901098901095,"d":"1%"},{"$f":"1/6*I85*(4*K85*L85+J85*I85+40*I85)","v":{"v":1164000,"d":"1,164,000"}}]
["flat","F 260 x 21",280,20,{"v":279.6119194254146,"d":"280"},{"$f":"C86*D86","v":5600},null,279.6119194254146,280,20,0,0,5600,{"v":0.01449275362318847,"d":"1%"}]
["built_t",{"$f":"CONCATENATE(\"T \",C87,\" x \",D87, \", \",E87,\" x \",F87)","v":"T 260 x 14, 140 x 14"},260,14,{"$f":"C87/2+10","v":140},{"$f":"D87","v":14},{"$f":"C87*D87+E87*F87","v":5600},{"v":379.47331922020555,"d":"379.5"},260,14,{"$f":"E87","v":140},{"$f":"F87","v":14},{"$f":"I87*J87+K87*L87","v":5600},{"v":0,"d":"0%"},{"$f":"1/6*I87*(4*K87*L87+J87*I87+40*I87)","v":{"v":948133.3333333333,"d":"948,133"}}]
["flat","F 280 x 19",260,22,{"v":234.91205475536535,"d":"235"},{"$f":"C88*D88","v":5720},null,234.91205475536532,260,22,0,0,5720,{"v":0.021428571428571352,"d":"2%"}]
["flat","F 280 x 20",280,21,{"v":265.63132345414385,"d":"266"},{"$f":"C89*D89","v":5880},null,265.63132345414385,280,21,0,0,5880,{"v":0.027972027972027913,"d":"3%"}]
["built_t",{"$f":"CONCATENATE(\"T \",C90,\" x \",D90, \", \",E90,\" x \",F90)","v":"T 320 x 12, 170 x 12"},320,12,{"$f":"C90/2+10","v":170},{"$f":"D90","v":12},{"$f":"C90*D90+E90*F90","v":5880},{"v":551.9611915930262,"d":"552.0"},320,12,{"$f":"E90","v":170},{"$f":"F90","v":12},{"$f":"I90*J90+K90*L90","v":5880},{"v":0,"d":"0%"},{"$f":"1/6*I90*(4*K90*L90+J90*I90+40*I90)","v":{"v":1322666.6666666665,"d":"1,322,667"}}]
["built_t",{"$f":"CONCATENATE(\"T \",C91,\" x \",D91, \", \",E91,\" x \",F91)","v":"T 280 x 14, 150 x 14"},280,14,{"$f":"C91/2+10","v":150},{"$f":"D91","v":14},{"$f":"C91*D91+E91*F91","v":6020},{"v":408.6635745448367,"d":"408.7"},280,14,{"$f":"E91","v":150},{"$f":"F91","v":14},{"$f":"I91*J91+K91*L91","v":6020},{"v":0.023809523809523725,"d":"2%"},{"$f":"1/6*I91*(4*K91*L91+J91*I91+40*I91)","v":{"v":1097600,"d":"1,097,600"}}]
["flat","F 280 x 21",280,22,{"v":252.98221281347037,"d":"253"},{"$f":"C92*D92","v":6160},null,252.98221281347037,280,22,0,0,6160,{"v":0.023255813953488413,"d":"2%"}]
["built_t",{"$f":"CONCATENATE(\"T \",C93,\" x \",D93, \", \",E93,\" x \",F93)","v":"T 260 x 16, 140 x 16"},260,16,{"$f":"C93/2+10","v":140},{"$f":"D93","v":16},{"$f":"C93*D93+E93*F93","v":6400},{"v":328.87687665751145,"d":"328.9"},260,16,{"$f":"E93","v":140},{"$f":"F93","v":16},{"$f":"I93*J93+K93*L93","v":6400},{"v":0.03896103896103886,"d":"4%"},{"$f":"1/6*I93*(4*K93*L93+J93*I93+40*I93)","v":{"v":1019199.9999999999,"d":"1,019,200"}}]
["flat","F 280 x 22",280,23,{"v":241.48302132194897,"d":"241"},{"$f":"C94*D94","v":6440},null,241.48302132194897,280,23,0,0,6440,{"v":0.006250000000000089,"d":"1%"}]
["built_t",{"$f":"CONCATENATE(\"T \",C95,\" x \",D95, \", \",E95,\" x \",F95)","v":"T 300 x 14, 160 x 14"},300,14,{"$f":"C95/2+10","v":160},{"$f":"D95","v":14},{"$f":"C95*D95+E95*F95","v":6440},{"v":437.8538298694679,"d":"437.9"},300,14,{"$f":"E95","v":160},{"$f":"F95","v":14},{"$f":"I95*J95+K95*L95","v":6440},{"v":0,"d":"0%"},{"$f":"1/6*I95*(4*K95*L95+J95*I95+40*I95)","v":{"v":1258000,"d":"1,258,000"}}]
["flat","F 300 x 21",300,22,{"v":271.05237087157536,"d":"271"},{"$f":"C96*D96","v":6600},null,271.05237087157536,300,22,0,0,6600,{"v":0.024844720496894457,"d":"2%"}]
["built_t",{"$f":"CONCATENATE(\"T \",C97,\" x \",D97, \", \",E97,\" x \",F97)","v":"T 320 x 14, 170 x 14"},320,14,{"$f":"C97/2+10","v":170},{"$f":"D97","v":14},{"$f":"C97*D97+E97*F97","v":6860},{"v":467.0440851940991,"d":"467.0"},320,14,{"$f":"E97","v":170},{"$f":"F97","v":14},{"$f":"I97*J97+K97*L97","v":6860},{"v":0.039393939393939315,"d":"4%"},{"$f":"1/6*I97*(4*K97*L97+J97*I97+40*I97)","v":{"v":1429333.3333333333,"d":"1,429,333"}}]
["built_t",{"$f":"CONCATENATE(\"T \",C98,\" x \",D98, \", \",E98,\" x \",F98)","v":"T 280 x 16, 150 x 16"},280,16,{"$f":"C98/2+10","v":150},{"$f":"D98","v":16},{"$f":"C98*D98+E98*F98","v":6880},{"v":354.1750979388585,"d":"354.2"},280,16,{"$f":"E98","v":150},{"$f":"F98","v":16},{"$f":"I98*J98+K98*L98","v":6880},{"v":0.00291545189504383,"d":"0%"},{"$f":"1/6*I98*(4*K98*L98+J98*I98+40*I98)","v":{"v":1179733.3333333333,"d":"1,179,733"}}]
["flat","F 300 x 22",300,23,{"v":258.73180855923107,"d":"259"},{"$f":"C99*D99","v":6900},null,258.73180855923107,300,23,0,0,6900,{"v":2.9069767441860517E-3,"d":"0%"}]
["flat","F 300 x 23",300,24,{"v":247.48259949143838,"d":"247"},{"$f":"C100*D100","v":7200},null,247.4825994914384,300,24,0,0,7200,{"v":0.04347826086956519,"d":"4%"}]
["built_t",{"$f":"CONCATENATE(\"T \",C101,\" x \",D101, \", \",E101,\" x \",F101)","v":"T 340 x 14, 180 x 14"},340,14,{"$f":"C101/2+10","v":180},{"$f":"D101","v":14},{"$f":"C101*D101+E101*F101","v":7280},{"v":496.2343405187303,"d":"496.2"},340,14,{"$f":"E101","v":180},{"$f":"F101","v":14},{"$f":"I101*J101+K101*L101","v":7280},{"v":0.011111111111111072,"d":"1%"},{"$f":"1/6*I101*(4*K101*L101+J101*I101+40*I101)","v":{"v":1611600,"d":"1,611,600"}}]
["flat","F 300 x 24",320,23,{"v":275.9805957965131,"d":"276"},{"$f":"C102*D102","v":7360},null,275.9805957965131,320,23,0,0,7360,{"v":0.01098901098901095,"d":"1%"}]
["built_t",{"$f":"CONCATENATE(\"T \",C103,\" x \",D103, \", \",E103,\" x \",F103)","v":"T 300 x 16, 160 x 16"},300,16,{"$f":"C103/2+10","v":160},{"$f":"D103","v":16},{"$f":"C103*D103+E103*F103","v":7360},{"v":379.47331922020555,"d":"379.5"},300,16,{"$f":"E103","v":160},{"$f":"F103","v":16},{"$f":"I103*J103+K103*L103","v":7360},{"v":0,"d":"0%"},{"$f":"1/6*I103*(4*K103*L103+J103*I103+40*I103)","v":{"v":1352000,"d":"1,352,000"}}]
["flat","F 320 x 22",300,25,{"v":237.17082451262846,"d":"237"},{"$f":"C104*D104","v":7500},null,237.17082451262846,300,25,0,0,7500,{"v":0.01902173913043481,"d":"2%"}]
["flat","F 320 x 23",320,24,{"v":263.9814394575343,"d":"264"},{"$f":"C105*D105","v":7680},null,263.9814394575343,320,24,0,0,7680,{"v":0.02400000000000002,"d":"2%"}]
["built_t",{"$f":"CONCATENATE(\"T \",C106,\" x \",D106, \", \",E106,\" x \",F106)","v":"T 360 x 14, 190 x 14"},360,14,{"$f":"C106/2+10","v":190},{"$f":"D106","v":14},{"$f":"C106*D106+E106*F106","v":7700},{"v":525.4245958433614,"d":"525.4"},360,14,{"$f":"E106","v":190},{"$f":"F106","v":14},{"$f":"I106*J106+K106*L106","v":7700},{"v":2.6041666666667407E-3,"d":"0%"},{"$f":"1/6*I106*(4*K106*L106+J106*I106+40*I106)","v":{"v":1804800,"d":"1,804,800"}}]
["built_t",{"$f":"CONCATENATE(\"T \",C107,\" x \",D107, \", \",E107,\" x \",F107)","v":"T 320 x 16, 170 x 16"},320,16,{"$f":"C107/2+10","v":170},{"$f":"D107","v":16},{"$f":"C107*D107+E107*F107","v":7840},{"v":404.7715405015526,"d":"404.8"},320,16,{"$f":"E107","v":170},{"$f":"F107","v":16},{"$f":"I107*J107+K107*L107","v":7840},{"v":0.018181818181818077,"d":"2%"},{"$f":"1/6*I107*(4*K107*L107+J107*I107+40*I107)","v":{"v":1535999.9999999998,"d":"1,536,000"}}]
["flat","F 320 x 24",320,25,{"v":252.98221281347037,"d":"253"},{"$f":"C108*D108","v":8000},null,252.98221281347037,320,25,0,0,8000,{"v":0.020408163265306145,"d":"2%"}]
["built_t",{"$f":"CONCATENATE(\"T \",C109,\" x \",D109, \", \",E109,\" x \",F109)","v":"T 380 x 14, 200 x 14"},380,14,{"$f":"C109/2+10","v":200},{"$f":"D109","v":14},{"$f":"C109*D109+E109*F109","v":8120},{"v":554.6148511679927,"d":"554.6"},380,14,{"$f":"E109","v":200},{"$f":"F109","v":14},{"$f":"I109*J109+K109*L109","v":8120},{"v":0.014999999999999902,"d":"1%"},{"$f":"1/6*I109*(4*K109*L109+J109*I109+40*I109)","v":{"v":2008933.3333333333,"d":"2,008,933"}}]
["flat","F 320 x 26",340,24,{"v":268.79360111431225,"d":"269"},{"$f":"C110*D110","v":8160},null,280.4802794236302,340,24,0,0,8160,{"v":4.9261083743843415E-3,"d":"0%"}]
["built_t",{"$f":"CONCATENATE(\"T \",C111,\" x \",D111, \", \",E111,\" x \",F111)","v":"T 300 x 18, 160 x 18"},300,18,{"$f":"C111/2+10","v":160},{"$f":"D111","v":18},{"$f":"C111*D111+E111*F111","v":8280},{"v":334.8293993119461,"d":"334.8"},300,18,{"$f":"E111","v":160},{"$f":"F111","v":18},{"$f":"I111*J111+K111*L111","v":8280},{"v":0.014705882352941124,"d":"1%"},{"$f":"1/6*I111*(4*K111*L111+J111*I111+40*I111)","v":{"v":1446000,"d":"1,446,000"}}]
["flat","F 320 x 25",320,26,{"v":242.86292430093155,"d":"243"},{"$f":"C112*D112","v":8320},null,242.86292430093155,320,26,0,0,8320,{"v":0.004830917874396157,"d":"0%"}]
["built_t",{"$f":"CONCATENATE(\"T \",C113,\" x \",D113, \", \",E113,\" x \",F113)","v":"T 340 x 16, 180 x 16"},340,16,{"$f":"C113/2+10","v":180},{"$f":"D113","v":16},{"$f":"C113*D113+E113*F113","v":8320},{"v":430.06976178289955,"d":"430.1"},340,16,{"$f":"E113","v":180},{"$f":"F113","v":16},{"$f":"I113*J113+K113*L113","v":8320},{"v":0,"d":"0%"},{"$f":"1/6*I113*(4*K113*L113+J113*I113+40*I113)","v":{"v":1731733.3333333333,"d":"1,731,733"}}]
["flat","F 340 x 25",340,25,{"v":258.04185706973976,"d":"258"},{"$f":"C114*D114","v":8500},null,268.79360111431225,340,25,0,0,8500,{"v":0.02163461538461542,"d":"2%"}]
["flat","F 340 x 24",320,27,{"v":233.52204259704956,"d":"234"},{"$f":"C115*D115","v":8640},null,233.52204259704956,320,27,0,0,8640,{"v":0.016470588235294015,"d":"2%"}]
["built_t",{"$f":"CONCATENATE(\"T \",C116,\" x \",D116, \", \",E116,\" x \",F116)","v":"T 360 x 16, 190 x 16"},360,16,{"$f":"C116/2+10","v":190},{"$f":"D116","v":16},{"$f":"C116*D116+E116*F116","v":8800},{"v":455.36798306424663,"d":"455.4"},360,16,{"$f":"E116","v":190},{"$f":"F116","v":16},{"$f":"I116*J116+K116*L116","v":8800},{"v":0.0185185185185186,"d":"2%"},{"$f":"1/6*I116*(4*K116*L116+J116*I116+40*I116)","v":{"v":1939200,"d":"1,939,200"}}]
["built_t",{"$f":"CONCATENATE(\"T \",C117,\" x \",D117, \", \",E117,\" x \",F117)","v":"T 320 x 18, 170 x 18"},320,18,{"$f":"C117/2+10","v":170},{"$f":"D117","v":18},{"$f":"C117*D117+E117*F117","v":8820},{"v":357.1513592660758,"d":"357.2"},320,18,{"$f":"E117","v":170},{"$f":"F117","v":18},{"$f":"I117*J117+K117*L117","v":8820},{"v":0.002272727272727204,"d":"0%"},{"$f":"1/6*I117*(4*K117*L117+J117*I117+40*I117)","v":{"v":1642666.6666666665,"d":"1,642,667"}}]
["flat","F 360 x 24",340,26,{"v":248.11717025936514,"d":"248"},{"$f":"C118*D118","v":8840},null,258.04185706973976,340,26,0,0,8840,{"v":2.2675736961450532E-3,"d":"0%"}]
["flat","F 340 x 26",340,27,{"v":238.92764543494422,"d":"239"},{"$f":"C119*D119","v":9180},null,248.11717025936514,340,27,0,0,9180,{"v":0.03846153846153855,"d":"4%"}]
["built_t",{"$f":"CONCATENATE(\"T \",C120,\" x \",D120, \", \",E120,\" x \",F120)","v":"T 380 x 16, 200 x 16"},380,16,{"$f":"MIN(C120/2+10,200)","v":200},{"$f":"D120","v":16},{"$f":"C120*D120+E120*F120","v":9280},{"v":480.66620434559366,"d":"480.7"},380,16,{"$f":"E120","v":200},{"$f":"F120","v":16},{"$f":"I120*J120+K120*L120","v":9280},{"v":0.01089324618736387,"d":"1%"},{"$f":"1/6*I120*(4*K120*L120+J120*I120+40*I120)","v":{"v":2158400,"d":"2,158,400"}}]
["flat","F 360 x 25",360,26,{"v":284.60498941515414,"d":"285"},{"$f":"C121*D121","v":9360},null,273.22078983854794,360,26,0,0,9360,{"v":0.008620689655172376,"d":"1%"}]
["built_t",{"$f":"CONCATENATE(\"T \",C122,\" x \",D122, \", \",E122,\" x \",F122)","v":"T 340 x 18, 180 x 18"},340,18,{"$f":"MIN(C122/2+10,200)","v":180},{"$f":"D122","v":18},{"$f":"C122*D122+E122*F122","v":9360},{"v":379.4733192202055,"d":"379.5"},340,18,{"$f":"E122","v":180},{"$f":"F122","v":18},{"$f":"I122*J122+K122*L122","v":9360},{"v":0,"d":"0%"},{"$f":"1/6*I122*(4*K122*L122+J122*I122+40*I122)","v":{"v":1851866.6666666665,"d":"1,851,867"}}]
["built_t",{"$f":"CONCATENATE(\"T \",C123,\" x \",D123, \", \",E123,\" x \",F123)","v":"T 400 x 16, 200 x 16"},400,16,{"$f":"MIN(C123/2+10,200)","v":200},{"$f":"D123","v":16},{"$f":"C123*D123+E123*F123","v":9600},{"v":505.9644256269407,"d":"506.0"},400,16,{"$f":"E123","v":200},{"$f":"F123","v":16},{"$f":"I123*J123+K123*L123","v":9600},{"v":0.02564102564102555,"d":"3%"},{"$f":"1/6*I123*(4*K123*L123+J123*I123+40*I123)","v":{"v":2346666.6666666665,"d":"2,346,667"}}]
["flat","F 340 x 27",360,27,{"v":273.220789838548,"d":"273"},{"$f":"C124*D124","v":9720},null,262.7122979216807,360,27,0,0,9720,{"v":0.012499999999999956,"d":"1%"}]
["built_t",{"$f":"CONCATENATE(\"T \",C125,\" x \",D125, \", \",E125,\" x \",F125)","v":"T 320 x 20, 170 x 20"},320,20,{"$f":"MIN(C125/2+10,200)","v":170},{"$f":"D125","v":20},{"$f":"C125*D125+E125*F125","v":9800},{"v":319.556479343331,"d":"319.6"},320,20,{"$f":"E125","v":170},20,{"$f":"I125*J125+K125*L125","v":9800},{"v":0.008230452674897082,"d":"1%"},{"$f":"1/6*I125*(4*K125*L125+J125*I125+40*I125)","v":{"v":1749333.3333333333,"d":"1,749,333"}}]
["built_t",{"$f":"CONCATENATE(\"T \",C126,\" x \",D126, \", \",E126,\" x \",F126)","v":"T 360 x 18, 190 x 18"},360,18,{"$f":"MIN(C126/2+10,200)","v":190},{"$f":"D126","v":18},{"$f":"C126*D126+E126*F126","v":9900},{"v":401.79527917433523,"d":"401.8"},360,18,190,18,{"$f":"I126*J126+K126*L126","v":9900},{"v":0.010204081632652962,"d":"1%"},{"$f":"1/6*I126*(4*K126*L126+J126*I126+40*I126)","v":{"v":2073600,"d":"2,073,600"}}]
["built_t",{"$f":"CONCATENATE(\"T \",C127,\" x \",D127, \", \",E127,\" x \",F127)","v":"T 420 x 16, 200 x 16"},420,16,{"$f":"MIN(C127/2+10,200)","v":200},{"$f":"D127","v":16},{"$f":"C127*D127+E127*F127","v":9920},{"v":531.2626469082877,"d":"531.3"},420,16,200,16,{"$f":"I127*J127+K127*L127","v":9920},{"v":0.002020202020202033,"d":"0%"},{"$f":"1/6*I127*(4*K127*L127+J127*I127+40*I127)","v":{"v":2542400,"d":"2,542,400"}}]
["flat","F 360 x 26",360,28,{"v":262.7122979216808,"d":"263"},{"$f":"C128*D128","v":10080},null,252.98221281347034,360,28,0,0,10080,{"v":0.016129032258064502,"d":"2%"}]
["built_t",{"$f":"CONCATENATE(\"T \",C129,\" x \",D129, \", \",E129,\" x \",F129)","v":"T 440 x 16, 200 x 16"},440,16,{"$f":"MIN(C129/2+10,200)","v":200},{"$f":"D129","v":16},{"$f":"C129*D129+E129*F129","v":10240},{"v":556.5608681896348,"d":"556.6"},440,16,{"$f":"E129","v":200},{"$f":"F129","v":16},{"$f":"I129*J129+K129*L129","v":10240},{"v":0.015873015873015817,"d":"2%"},{"$f":"1/6*I129*(4*K129*L129+J129*I129+40*I129)","v":{"v":2745600,"d":"2,745,600"}}]
["flat","F 380 x 27",380,27,{"v":277.30742558399635,"d":"277"},{"$f":"C130*D130","v":10260},null,277.30742558399635,380,27,0,0,10260,{"v":1.953125E-3,"d":"0%"}]
["built_t",{"$f":"CONCATENATE(\"T \",C131,\" x \",D131, \", \",E131,\" x \",F131)","v":"T 340 x 20, 180 x 20"},340,20,{"$f":"MIN(C131/2+10,200)","v":180},{"$f":"D131","v":20},{"$f":"C131*D131+E131*F131","v":10400},{"v":339.52875930228913,"d":"339.5"},340,20,{"$f":"E131","v":180},{"$f":"F131","v":20},{"$f":"I131*J131+K131*L131","v":10400},{"v":0.013645224171539905,"d":"1%"},{"$f":"1/6*I131*(4*K131*L131+J131*I131+40*I131)","v":{"v":1972000,"d":"1,972,000"}}]
["flat","F 360 x 27",360,29,{"v":252.98221281347037,"d":"253"},{"$f":"C132*D132","v":10440},null,{"$f":"C132*SQRT(360)/(D132-1)","v":243.94713378441784},{"$f":"C132","v":360},{"$f":"D132","v":29},0,0,10440,{"v":3.8461538461538325E-3,"d":"0%"}]
["built_t",{"$f":"CONCATENATE(\"T \",C133,\" x \",D133, \", \",E133,\" x \",F133)","v":"T 380 x 18, 200 x 18"},380,18,{"$f":"MIN(C133/2+10,200)","v":200},{"$f":"D133","v":18},{"$f":"C133*D133+E133*F133","v":10440},{"v":424.117239128465,"d":"424.1"},380,18,{"$f":"E133","v":200},{"$f":"F133","v":18},{"$f":"I133*J133+K133*L133","v":10440},{"v":0,"d":"0%"},{"$f":"1/6*I133*(4*K133*L133+J133*I133+40*I133)","v":{"v":2307866.6666666665,"d":"2,307,867"}}]
["flat","F 360 x 29",380,28,{"v":267.0367801919965,"d":"267"},{"$f":"C134*D134","v":10640},null,267.03678019199646,380,28,0,0,10640,{"$f":"M134/M133-1","v":{"v":0.019157088122605304,"d":"2%"}}]
["flat","F 380 x 26",360,30,{"v":243.94713378441784,"d":"244"},{"$f":"C135*D135","v":10800},null,235.53516365392068,360,30,0,0,10800,{"v":0.015037593984962516,"d":"2%"}]
["built_t",{"$f":"CONCATENATE(\"T \",C136,\" x \",D136, \", \",E136,\" x \",F136)","v":"T 400 x 18, 200 x 18"},400,18,{"$f":"MIN(C136/2+10,200)","v":200},{"$f":"D136","v":18},{"$f":"C136*D136+E136*F136","v":10800},{"v":446.43919908259477,"d":"446.4"},400,18,{"$f":"E136","v":200},{"$f":"F136","v":18},{"$f":"I136*J136+K136*L136","v":10800},{"v":0,"d":"0%"},{"$f":"1/6*I136*(4*K136*L136+J136*I136+40*I136)","v":{"v":2506666.6666666665,"d":"2,506,667"}}]
["built_t",{"$f":"CONCATENATE(\"T \",C137,\" x \",D137, \", \",E137,\" x \",F137)","v":"T 360 x 20, 190 x 20"},360,20,{"$f":"MIN(C137/2+10,200)","v":190},{"$f":"D137","v":20},{"$f":"C137*D137+E137*F137","v":11000},{"v":359.50103926124734,"d":"359.5"},360,20,{"$f":"E137","v":190},{"$f":"F137","v":20},{"$f":"I137*J137+K137*L137","v":11000},{"v":0.0185185185185186,"d":"2%"},{"$f":"1/6*I137*(4*K137*L137+J137*I137+40*I137)","v":{"v":2208000,"d":"2,208,000"}}]
["flat","F 380 x 28",380,29,{"v":257.4997523279966,"d":"257"},{"$f":"C138*D138","v":11020},null,257.4997523279966,380,29,0,0,11020,{"v":1.8181818181817189E-3,"d":"0%"}]
["flat","F 360 x 28",360,31,{"v":235.53516365392068,"d":"236"},{"$f":"C139*D139","v":11160},null,227.68399153212331,360,31,0,0,11160,{"v":0.012704174228675091,"d":"1%"}]
["built_t",{"$f":"CONCATENATE(\"T \",C140,\" x \",D140, \", \",E140,\" x \",F140)","v":"T 420 x 18, 200 x 18"},420,18,{"$f":"MIN(C140/2+10,200)","v":200},{"$f":"D140","v":18},{"$f":"C140*D140+E140*F140","v":11160},{"v":468.7611590367245,"d":"468.8"},420,18,{"$f":"E140","v":200},{"$f":"F140","v":18},{"$f":"I140*J140+K140*L140","v":11160},{"v":0,"d":"0%"},{"$f":"1/6*I140*(4*K140*L140+J140*I140+40*I140)","v":{"v":2713200,"d":"2,713,200"}}]
["flat","F 400 x 28",400,28,{"v":281.0913475705226,"d":"281"},{"$f":"C141*D141","v":11200},null,281.0913475705226,400,28,0,0,11200,{"v":3.5842293906809264E-3,"d":"0%"}]
["flat","F 400 x 27",380,30,{"v":248.62045052358295,"d":"249"},{"$f":"C142*D142","v":11400},null,248.62045052358292,380,30,0,0,11400,{"v":0.017857142857142794,"d":"2%"}]
["built_t",{"$f":"CONCATENATE(\"T \",C143,\" x \",D143, \", \",E143,\" x \",F143)","v":"T 340 x 22, 180 x 22"},340,22,{"$f":"MIN(C143/2+10,200)","v":180},{"$f":"D143","v":22},{"$f":"C143*D143+E143*F143","v":11440},{"v":307.1926869877854,"d":"307.2"},340,22,{"$f":"E143","v":180},{"$f":"F143","v":22},{"$f":"I143*J143+K143*L143","v":11440},{"v":3.5087719298245723E-3,"d":"0%"},{"$f":"1/6*I143*(4*K143*L143+J143*I143+40*I143)","v":{"v":2092133.3333333333,"d":"2,092,133"}}]
["built_t",{"$f":"CONCATENATE(\"T \",C144,\" x \",D144, \", \",E144,\" x \",F144)","v":"T 440 x 18, 200 x 18"},440,18,{"$f":"MIN(C144/2+10,200)","v":200},{"$f":"D144","v":18},{"$f":"C144*D144+E144*F144","v":11520},{"v":491.0831189908542,"d":"491.1"},440,18,{"$f":"E144","v":200},{"$f":"F144","v":18},{"$f":"I144*J144+K144*L144","v":11520},{"v":0.006993006993007089,"d":"1%"},{"$f":"1/6*I144*(4*K144*L144+J144*I144+40*I144)","v":{"v":2927466.6666666665,"d":"2,927,467"}}]
["flat","F 380 x 30",400,29,{"v":271.05237087157536,"d":"271"},{"$f":"C145*D145","v":11600},null,271.05237087157536,400,29,0,0,11600,{"v":0.00694444444444442,"d":"1%"}]
["built_t",{"$f":"CONCATENATE(\"T \",C146,\" x \",D146, \", \",E146,\" x \",F146)","v":"T 380 x 20, 200 x 20"},380,20,{"$f":"MIN(C146/2+10,200)","v":200},{"$f":"D146","v":20},{"$f":"C146*D146+E146*F146","v":11600},{"v":379.4733192202055,"d":"379.5"},380,20,{"$f":"E146","v":200},{"$f":"F146","v":20},{"$f":"I146*J146+K146*L146","v":11600},{"v":0,"d":"0%"},{"$f":"1/6*I146*(4*K146*L146+J146*I146+40*I146)","v":{"v":2457333.333333333,"d":"2,457,333"}}]
["flat","F 380 x 29",380,31,{"v":240.33310217279683,"d":"240"},{"$f":"C147*D147","v":11780},null,240.33310217279683,380,31,0,0,11780,{"v":0.01551724137931032,"d":"2%"}]
["built_t",{"$f":"CONCATENATE(\"T \",C148,\" x \",D148, \", \",E148,\" x \",F148)","v":"T 460 x 18, 200 x 18"},460,18,{"$f":"MIN(C148/2+10,200)","v":200},{"$f":"D148","v":18},{"$f":"C148*D148+E148*F148","v":11880},{"v":513.4050789449839,"d":"513.4"},460,18,{"$f":"E148","v":200},{"$f":"F148","v":18},{"$f":"I148*J148+K148*L148","v":11880},{"v":0.008488964346349714,"d":"1%"},{"$f":"1/6*I148*(4*K148*L148+J148*I148+40*I148)","v":{"v":3149466.666666666,"d":"3,149,467"}}]
["flat","F 400 x 29",400,30,{"v":261.70573739324516,"d":"262"},{"$f":"C149*D149","v":12000},null,261.7057373932452,400,30,0,0,12000,{"v":0.010101010101010166,"d":"1%"}]
["built_t",{"$f":"CONCATENATE(\"T \",C150,\" x \",D150, \", \",E150,\" x \",F150)","v":"T 400 x 20, 200 x 20"},400,20,{"$f":"MIN(C150/2+10,200)","v":200},{"$f":"D150","v":20},{"$f":"C150*D150+E150*F150","v":12000},{"v":399.4455991791637,"d":"399.4"},400,20,{"$f":"E150","v":200},20,{"$f":"I150*J150+K150*L150","v":12000},{"v":0,"d":"0%"},{"$f":"1/6*I150*(4*K150*L150+J150*I150+40*I150)","v":{"v":2666666.6666666665,"d":"2,666,667"}}]
["built_t",{"$f":"CONCATENATE(\"T \",C151,\" x \",D151, \", \",E151,\" x \",F151)","v":"T 360 x 22, 190 x 22"},360,22,{"$f":"MIN(C151/2+10,200)","v":190},{"$f":"D151","v":22},{"$f":"C151*D151+E151*F151","v":12100},{"v":325.26284504589046,"d":"325.3"},360,22,190,22,{"$f":"I151*J151+K151*L151","v":12100},{"v":0.008333333333333304,"d":"1%"},{"$f":"1/6*I151*(4*K151*L151+J151*I151+40*I151)","v":{"v":2342400,"d":"2,342,400"}}]
["built_t",{"$f":"CONCATENATE(\"T \",C152,\" x \",D152, \", \",E152,\" x \",F152)","v":"T 480 x 18, 200 x 18"},480,18,{"$f":"MIN(C152/2+10,200)","v":200},{"$f":"D152","v":18},{"$f":"C152*D152+E152*F152","v":12240},{"v":535.7270388991137,"d":"535.7"},480,18,200,18,{"$f":"I152*J152+K152*L152","v":12240},{"v":0.011570247933884392,"d":"1%"},{"$f":"1/6*I152*(4*K152*L152+J152*I152+40*I152)","v":{"v":3379200,"d":"3,379,200"}}]
["flat","F 420 x 28",400,31,{"v":252.98221281347037,"d":"253"},{"$f":"C153*D153","v":12400},null,252.98221281347034,400,31,0,0,12400,{"v":0.013071895424836555,"d":"1%"}]
["built_t",{"$f":"CONCATENATE(\"T \",C154,\" x \",D154, \", \",E154,\" x \",F154)","v":"T 420 x 20, 200 x 20"},420,20,{"$f":"MIN(C154/2+10,200)","v":200},{"$f":"D154","v":20},{"$f":"C154*D154+E154*F154","v":12400},{"v":419.4178791381219,"d":"419.4"},420,20,{"$f":"E154","v":200},{"$f":"F154","v":20},{"$f":"I154*J154+K154*L154","v":12400},{"v":0,"d":"0%"},{"$f":"1/6*I154*(4*K154*L154+J154*I154+40*I154)","v":{"v":2884000,"d":"2,884,000"}}]
["flat","F 400 x 31",420,30,{"v":284.60498941515414,"d":"285"},{"$f":"C155*D155","v":12600},null,274.79102426290746,420,30,0,0,12600,{"v":0.016129032258064502,"d":"2%"}]
["built_t",{"$f":"CONCATENATE(\"T \",C156,\" x \",D156, \", \",E156,\" x \",F156)","v":"T 380 x 22, 200 x 22"},380,22,{"$f":"MIN(C156/2+10,200)","v":200},{"$f":"D156","v":22},{"$f":"C156*D156+E156*F156","v":12760},{"v":343.33300310399545,"d":"343.3"},380,22,{"$f":"E156","v":200},{"$f":"F156","v":22},{"$f":"I156*J156+K156*L156","v":12760},{"v":0.012698412698412653,"d":"1%"},{"$f":"1/6*I156*(4*K156*L156+J156*I156+40*I156)","v":{"v":2606800,"d":"2,606,800"}}]
["flat","F 400 x 30",400,32,{"v":244.82149627110033,"d":"245"},{"$f":"C157*D157","v":12800},null,244.82149627110033,400,32,0,0,12800,{"v":3.1347962382444194E-3,"d":"0%"}]
["built_t",{"$f":"CONCATENATE(\"T \",C158,\" x \",D158, \", \",E158,\" x \",F158)","v":"T 440 x 20, 200 x 20"},440,20,{"$f":"MIN(C158/2+10,200)","v":200},{"$f":"D158","v":20},{"$f":"C158*D158+E158*F158","v":12800},{"v":439.3901590970801,"d":"439.4"},440,20,{"$f":"E158","v":200},{"$f":"F158","v":20},{"$f":"I158*J158+K158*L158","v":12800},{"v":0,"d":"0%"},{"$f":"1/6*I158*(4*K158*L158+J158*I158+40*I158)","v":{"v":3109333.333333333,"d":"3,109,333"}}]
["flat","F 420 x 30",420,31,{"v":274.79102426290746,"d":"275"},{"$f":"C159*D159","v":13020},null,265.63132345414385,420,31,0,0,13020,{"v":0.01718749999999991,"d":"2%"}]
["flat","F 420 x 29",400,33,{"v":237.17082451262846,"d":"237"},{"$f":"C160*D160","v":13200},null,237.17082451262846,400,33,0,0,13200,{"v":0.01382488479262678,"d":"1%"}]
["built_t",{"$f":"CONCATENATE(\"T \",C161,\" x \",D161, \", \",E161,\" x \",F161)","v":"T 360 x 24, 190 x 24"},360,24,{"$f":"MIN(C161/2+10,200)","v":190},{"$f":"D161","v":24},{"$f":"C161*D161+E161*F161","v":13200},{"v":296.97911938972607,"d":"297.0"},360,24,{"$f":"E161","v":190},24,{"$f":"I161*J161+K161*L161","v":13200},{"v":0,"d":"0%"},{"$f":"1/6*I161*(4*K161*L161+J161*I161+40*I161)","v":{"v":2476800,"d":"2,476,800"}}]
["built_t",{"$f":"CONCATENATE(\"T \",C162,\" x \",D162, \", \",E162,\" x \",F162)","v":"T 400 x 22, 200 x 22"},400,22,{"$f":"MIN(C162/2+10,200)","v":200},{"$f":"D162","v":22},{"$f":"C162*D162+E162*F162","v":13200},{"v":361.4031611621005,"d":"361.4"},400,22,200,22,{"$f":"I162*J162+K162*L162","v":13200},{"v":0,"d":"0%"},{"$f":"1/6*I162*(4*K162*L162+J162*I162+40*I162)","v":{"v":2826666.666666666,"d":"2,826,667"}}]
["built_t",{"$f":"CONCATENATE(\"T \",C163,\" x \",D163, \", \",E163,\" x \",F163)","v":"T 460 x 20, 200 x 20"},460,20,{"$f":"MIN(C163/2+10,200)","v":200},{"$f":"D163","v":20},{"$f":"C163*D163+E163*F163","v":13200},{"v":459.3624390560382,"d":"459.4"},460,20,200,20,{"$f":"I163*J163+K163*L163","v":13200},{"v":0,"d":"0%"},{"$f":"1/6*I163*(4*K163*L163+J163*I163+40*I163)","v":{"v":3342666.666666666,"d":"3,342,667"}}]
["flat","F 400 x 32",420,32,{"v":265.63132345414385,"d":"266"},{"$f":"C164*D164","v":13440},null,257.06257108465536,420,32,0,0,13440,{"v":0.018181818181818077,"d":"2%"}]
["flat","F 420 x 33",440,31,{"v":241.48302132194897,"d":"241"},{"$f":"C165*D165","v":13640},null,278.2804340948174,440,31,0,0,13640,{"v":0.014880952380952328,"d":"1%"}]
["built_t",{"$f":"CONCATENATE(\"T \",C166,\" x \",D166, \", \",E166,\" x \",F166)","v":"T 420 x 22, 200 x 22"},420,22,{"$f":"MIN(C166/2+10,200)","v":200},{"$f":"D166","v":22},{"$f":"C166*D166+E166*F166","v":13640},{"v":379.47331922020555,"d":"379.5"},420,22,{"$f":"E166","v":200},{"$f":"F166","v":22},{"$f":"I166*J166+K166*L166","v":13640},{"v":0,"d":"0%"},{"$f":"1/6*I166*(4*K166*L166+J166*I166+40*I166)","v":{"v":3054800,"d":"3,054,800"}}]
["flat","F 420 x 31",420,33,{"v":257.06257108465536,"d":"257"},{"$f":"C167*D167","v":13860},null,249.02936573825988,420,33,0,0,13860,{"v":0.016129032258064502,"d":"2%"}]
["built_t",{"$f":"CONCATENATE(\"T \",C168,\" x \",D168, \", \",E168,\" x \",F168)","v":"T 500 x 20, 200 x 20"},500,20,{"$f":"MIN(C168/2+10,200)","v":200},{"$f":"D168","v":20},{"$f":"C168*D168+E168*F168","v":14000},{"v":499.30699897395465,"d":"499.3"},500,20,{"$f":"E168","v":200},{"$f":"F168","v":20},{"$f":"I168*J168+K168*L168","v":14000},{"v":0.010101010101010166,"d":"1%"},{"$f":"1/6*I168*(4*K168*L168+J168*I168+40*I168)","v":{"v":3833333.333333333,"d":"3,833,333"}}]
["built_t",{"$f":"CONCATENATE(\"T \",C169,\" x \",D169, \", \",E169,\" x \",F169)","v":"T 440 x 22, 200 x 22"},440,22,{"$f":"MIN(C169/2+10,200)","v":200},{"$f":"D169","v":22},{"$f":"C169*D169+E169*F169","v":14080},{"v":397.54347727831055,"d":"397.5"},440,22,{"$f":"E169","v":200},{"$f":"F169","v":22},{"$f":"I169*J169+K169*L169","v":14080},{"v":0.005714285714285783,"d":"1%"},{"$f":"1/6*I169*(4*K169*L169+J169*I169+40*I169)","v":{"v":3291200,"d":"3,291,200"}}]
["flat","F 420 x 32",420,34,{"v":249.02936573825988,"d":"249"},{"$f":"C170*D170","v":14280},null,241.48302132194897,420,34,0,0,14280,{"v":0.014204545454545414,"d":"1%"}]
["built_t",{"$f":"CONCATENATE(\"T \",C171,\" x \",D171, \", \",E171,\" x \",F171)","v":"T 400 x 24, 200 x 24"},400,24,{"$f":"MIN(C171/2+10,200)","v":200},{"$f":"D171","v":24},{"$f":"C171*D171+E171*F171","v":14400},{"v":329.97679932191784,"d":"330.0"},400,24,{"$f":"E171","v":200},{"$f":"F171","v":24},{"$f":"I171*J171+K171*L171","v":14400},{"v":0.008403361344537785,"d":"1%"},{"$f":"1/6*I171*(4*K171*L171+J171*I171+40*I171)","v":{"v":2986666.666666666,"d":"2,986,667"}}]
["flat","F 420 x 34",440,33,{"v":234.38057951836225,"d":"234"},{"$f":"C172*D172","v":14520},null,260.8879069638913,440,33,0,0,14520,{"v":0.008333333333333304,"d":"1%"}]
["built_t",{"$f":"CONCATENATE(\"T \",C173,\" x \",D173, \", \",E173,\" x \",F173)","v":"T 460 x 22, 200 x 22"},460,22,{"$f":"MIN(C173/2+10,200)","v":200},{"$f":"D173","v":22},{"$f":"C173*D173+E173*F173","v":14520},{"v":415.61363533641554,"d":"415.6"},460,22,{"$f":"E173","v":200},{"$f":"F173","v":22},{"$f":"I173*J173+K173*L173","v":14520},{"v":0,"d":"0%"},{"$f":"1/6*I173*(4*K173*L173+J173*I173+40*I173)","v":{"v":3535866.666666666,"d":"3,535,867"}}]
["flat","F 420 x 36",460,32,{"v":221.35943621178654,"d":"221"},{"$f":"C174*D174","v":14720},null,281.54472071176536,460,32,0,0,14720,{"v":0.01377410468319562,"d":"1%"}]
["built_t",{"$f":"CONCATENATE(\"T \",C175,\" x \",D175, \", \",E175,\" x \",F175)","v":"T 540 x 20, 200 x 20"},540,20,{"$f":"MIN(C175/2+10,200)","v":200},{"$f":"D175","v":20},{"$f":"C175*D175+E175*F175","v":14800},{"v":539.251558891871,"d":"539.3"},540,20,{"$f":"E175","v":200},20,{"$f":"I175*J175+K175*L175","v":14800},{"v":0.005434782608695565,"d":"1%"},{"$f":"1/6*I175*(4*K175*L175+J175*I175+40*I175)","v":{"v":4356000,"d":"4,356,000"}}]
["built_t",{"$f":"CONCATENATE(\"T \",C176,\" x \",D176, \", \",E176,\" x \",F176)","v":"T 420 x 24, 200 x 24"},420,24,{"$f":"MIN(C176/2+10,200)","v":200},{"$f":"D176","v":24},{"$f":"C176*D176+E176*F176","v":14880},{"v":346.4756392880137,"d":"346.5"},420,24,200,24,{"$f":"I176*J176+K176*L176","v":14880},{"v":0.00540540540540535,"d":"1%"},{"$f":"1/6*I176*(4*K176*L176+J176*I176+40*I176)","v":{"v":3225600,"d":"3,225,600"}}]
["built_t",{"$f":"CONCATENATE(\"T \",C177,\" x \",D177, \", \",E177,\" x \",F177)","v":"T 440 x 24, 200 x 24"},440,24,{"$f":"MIN(C177/2+10,200)","v":200},{"$f":"D177","v":24},{"$f":"C177*D177+E177*F177","v":15360},{"v":362.9744792541096,"d":"363.0"},440,24,200,24,{"$f":"I177*J177+K177*L177","v":15360},{"v":0.032258064516129004,"d":"3%"},{"$f":"1/6*I177*(4*K177*L177+J177*I177+40*I177)","v":{"v":3473066.6666666665,"d":"3,473,067"}}]
["flat","F 420 x 35",440,35,{"v":227.68399153212331,"d":"228"},{"$f":"C178*D178","v":15400},null,245.5415594954271,440,35,0,0,15400,{"v":2.6041666666667407E-3,"d":"0%"}]
["built_t",{"$f":"CONCATENATE(\"T \",C179,\" x \",D179, \", \",E179,\" x \",F179)","v":"T 500 x 22, 200 x 22"},500,22,{"$f":"MIN(C179/2+10,200)","v":200},{"$f":"D179","v":22},{"$f":"C179*D179+E179*F179","v":15400},{"v":451.75395145262564,"d":"451.8"},500,22,{"$f":"E179","v":200},{"$f":"F179","v":22},{"$f":"I179*J179+K179*L179","v":15400},{"v":0,"d":"0%"},{"$f":"1/6*I179*(4*K179*L179+J179*I179+40*I179)","v":{"v":4050000,"d":"4,050,000"}}]
["built_t",{"$f":"CONCATENATE(\"T \",C180,\" x \",D180, \", \",E180,\" x \",F180)","v":"T 400 x 26, 200 x 26"},400,26,{"$f":"MIN(C180/2+10,200)","v":200},{"$f":"D180","v":26},{"$f":"C180*D180+E180*F180","v":15600},{"v":303.5786553761644,"d":"303.6"},400,26,{"$f":"E180","v":200},{"$f":"F180","v":26},{"$f":"I180*J180+K180*L180","v":15600},{"v":0.01298701298701288,"d":"1%"},{"$f":"1/6*I180*(4*K180*L180+J180*I180+40*I180)","v":{"v":3146666.666666666,"d":"3,146,667"}}]
["flat","F 420 x 37",460,34,{"v":215.03488089145,"d":"215"},{"$f":"C181*D181","v":15640},null,264.4814043049917,460,34,0,0,15640,{"v":2.564102564102555E-3,"d":"0%"}]
["built_t",{"$f":"CONCATENATE(\"T \",C182,\" x \",D182, \", \",E182,\" x \",F182)","v":"T 460 x 24, 200 x 24"},460,24,{"$f":"MIN(C182/2+10,200)","v":200},{"$f":"D182","v":24},{"$f":"C182*D182+E182*F182","v":15840},{"v":379.4733192202055,"d":"379.5"},460,24,{"$f":"E182","v":200},24,{"$f":"I182*J182+K182*L182","v":15840},{"v":0.01278772378516635,"d":"1%"},{"$f":"1/6*I182*(4*K182*L182+J182*I182+40*I182)","v":{"v":3729066.666666666,"d":"3,729,067"}}]
["built_t",{"$f":"CONCATENATE(\"T \",C183,\" x \",D183, \", \",E183,\" x \",F183)","v":"T 420 x 26, 200 x 26"},420,26,{"$f":"MIN(C183/2+10,200)","v":200},{"$f":"D183","v":26},{"$f":"C183*D183+E183*F183","v":16120},{"v":318.75758814497266,"d":"318.8"},420,26,200,26,{"$f":"I183*J183+K183*L183","v":16120},{"v":0.017676767676767735,"d":"2%"},{"$f":"1/6*I183*(4*K183*L183+J183*I183+40*I183)","v":{"v":3396400,"d":"3,396,400"}}]
["built_t",{"$f":"CONCATENATE(\"T \",C184,\" x \",D184, \", \",E184,\" x \",F184)","v":"T 540 x 22, 200 x 22"},540,22,{"$f":"MIN(C184/2+10,200)","v":200},{"$f":"D184","v":22},{"$f":"C184*D184+E184*F184","v":16280},{"v":487.8942675688357,"d":"487.9"},540,22,200,22,{"$f":"I184*J184+K184*L184","v":16280},{"v":0.00992555831265518,"d":"1%"},{"$f":"1/6*I184*(4*K184*L184+J184*I184+40*I184)","v":{"v":4597200,"d":"4,597,200"}}]
["flat","F 420 x 39",480,34,{"v":208.710325571113,"d":"209"},{"$f":"C185*D185","v":16320},null,275.9805957965131,480,34,0,0,16320,{"v":0.002457002457002533,"d":"0%"}]
["flat","F 420 x 38",460,36,{"v":208.710325571113,"d":"209"},{"$f":"C186*D186","v":16560},null,249.36818120184932,460,36,0,0,16560,{"v":0.014705882352941124,"d":"1%"}]
["built_t",{"$f":"CONCATENATE(\"T \",C187,\" x \",D187, \", \",E187,\" x \",F187)","v":"T 440 x 26, 200 x 26"},440,26,{"$f":"MIN(C187/2+10,200)","v":200},{"$f":"D187","v":26},{"$f":"C187*D187+E187*F187","v":16640},{"v":333.93652091378084,"d":"333.9"},440,26,{"$f":"E187","v":200},26,{"$f":"I187*J187+K187*L187","v":16640},{"v":0.004830917874396157,"d":"0%"},{"$f":"1/6*I187*(4*K187*L187+J187*I187+40*I187)","v":{"v":3654933.333333333,"d":"3,654,933"}}]
["built_t",{"$f":"CONCATENATE(\"T \",C188,\" x \",D188, \", \",E188,\" x \",F188)","v":"T 500 x 24, 200 x 24"},500,24,{"$f":"MIN(C188/2+10,200)","v":200},{"$f":"D188","v":24},{"$f":"C188*D188+E188*F188","v":16800},{"v":412.4709991523973,"d":"412.5"},500,24,200,24,{"$f":"I188*J188+K188*L188","v":16800},{"v":0.009615384615384581,"d":"1%"},{"$f":"1/6*I188*(4*K188*L188+J188*I188+40*I188)","v":{"v":4266666.666666666,"d":"4,266,667"}}]
["built_t",{"$f":"CONCATENATE(\"T \",C189,\" x \",D189, \", \",E189,\" x \",F189)","v":"T 460 x 26, 200 x 26"},460,26,{"$f":"MIN(C189/2+10,200)","v":200},{"$f":"D189","v":26},{"$f":"C189*D189+E189*F189","v":17160},{"v":349.1154536825891,"d":"349.1"},460,26,200,26,{"$f":"I189*J189+K189*L189","v":17160},{"v":0.021428571428571352,"d":"2%"},{"$f":"1/6*I189*(4*K189*L189+J189*I189+40*I189)","v":{"v":3922266.666666666,"d":"3,922,267"}}]
["built_t",{"$f":"CONCATENATE(\"T \",C190,\" x \",D190, \", \",E190,\" x \",F190)","v":"T 580 x 22, 200 x 22"},580,22,{"$f":"MIN(C190/2+10,200)","v":200},{"$f":"D190","v":22},{"$f":"C190*D190+E190*F190","v":17160},{"v":524.0345836850457,"d":"524.0"},580,22,200,22,{"$f":"I190*J190+K190*L190","v":17160},{"v":0,"d":"0%"},{"$f":"1/6*I190*(4*K190*L190+J190*I190+40*I190)","v":{"v":5177466.666666666,"d":"5,177,467"}}]
["flat","F 420 x 40",480,36,{"v":208.710325571113,"d":"209"},{"$f":"C191*D191","v":17280},null,260.21027603671234,480,36,0,0,17280,{"v":0.006993006993007089,"d":"1%"}]
["built_t",{"$f":"CONCATENATE(\"T \",C192,\" x \",D192, \", \",E192,\" x \",F192)","v":"T 420 x 28, 200 x 28"},420,28,{"$f":"MIN(C192/2+10,200)","v":200},{"$f":"D192","v":28},{"$f":"C192*D192+E192*F192","v":17360},{"v":295.14591494904874,"d":"295.1"},420,28,{"$f":"E192","v":200},{"$f":"F192","v":28},{"$f":"I192*J192+K192*L192","v":17360},{"v":0.004629629629629539,"d":"0%"},{"$f":"1/6*I192*(4*K192*L192+J192*I192+40*I192)","v":{"v":3567200,"d":"3,567,200"}}]
["flat","F 420 x 42",500,35,{"v":208.710325571113,"d":"209"},{"$f":"C193*D193","v":17500},null,279.02449942662173,500,35,0,0,17500,{"v":0.008064516129032251,"d":"1%"}]
["built_t",{"$f":"CONCATENATE(\"T \",C194,\" x \",D194, \", \",E194,\" x \",F194)","v":"T 540 x 24, 200 x 24"},540,24,{"$f":"MIN(C194/2+10,200)","v":200},{"$f":"D194","v":24},{"$f":"C194*D194+E194*F194","v":17760},{"v":445.4686790845891,"d":"445.5"},540,24,{"$f":"E194","v":200},24,{"$f":"I194*J194+K194*L194","v":17760},{"v":0.014857142857142902,"d":"1%"},{"$f":"1/6*I194*(4*K194*L194+J194*I194+40*I194)","v":{"v":4838400,"d":"4,838,400"}}]
["built_t",{"$f":"CONCATENATE(\"T \",C195,\" x \",D195, \", \",E195,\" x \",F195)","v":"T 440 x 28, 200 x 28"},440,28,{"$f":"MIN(C195/2+10,200)","v":200},{"$f":"D195","v":28},{"$f":"C195*D195+E195*F195","v":17920},{"v":309.20048232757483,"d":"309.2"},440,28,200,28,{"$f":"I195*J195+K195*L195","v":17920},{"v":9.009009009008917E-3,"d":"1%"},{"$f":"1/6*I195*(4*K195*L195+J195*I195+40*I195)","v":{"v":3836799.9999999995,"d":"3,836,800"}}]
["built_t",{"$f":"CONCATENATE(\"T \",C196,\" x \",D196, \", \",E196,\" x \",F196)","v":"T 500 x 26, 200 x 26"},500,26,{"$f":"MIN(C196/2+10,200)","v":200},{"$f":"D196","v":26},{"$f":"C196*D196+E196*F196","v":18200},{"$f":"C196*SQRT(360)/(D196-1)","v":{"v":379.4733192202055,"d":"379.5"}},{"$f":"C196","v":500},{"$f":"D196","v":26},200,26,{"$f":"I196*J196+K196*L196","v":18200},{"v":0.015625,"d":"2%"},{"$f":"1/6*I196*(4*K196*L196+J196*I196+40*I196)","v":{"v":4483333.333333333,"d":"4,483,333"}}]
["flat","F 420 x 41",480,38,{"v":208.710325571113,"d":"209"},{"$f":"C197*D197","v":18240},null,246.1448557104036,480,38,0,0,18240,{"v":2.19780219780219E-3,"d":"0%"}]
["flat","F 420 x 43",500,37,{"v":208.710325571113,"d":"209"},{"$f":"C198*D198","v":18500},null,263.5231383473649,500,37,0,0,18500,{"$f":"M198/M197-1","v":{"v":0.014254385964912242,"d":"1%"}}]
["built_t",{"$f":"CONCATENATE(\"T \",C199,\" x \",D199, \", \",E199,\" x \",F199)","v":"T 580 x 24, 200 x 24"},580,24,{"$f":"MIN(C199/2+10,200)","v":200},{"$f":"D199","v":24},{"$f":"C199*D199+E199*F199","v":18720},{"v":478.4663590167809,"d":"478.5"},580,24,{"$f":"E199","v":200},{"$f":"F199","v":24},{"$f":"I199*J199+K199*L199","v":18720},{"v":0.011891891891891992,"d":"1%"},{"$f":"1/6*I199*(4*K199*L199+J199*I199+40*I199)","v":{"v":5444266.666666666,"d":"5,444,267"}}]
["built_t",{"$f":"CONCATENATE(\"T \",C200,\" x \",D200, \", \",E200,\" x \",F200)","v":"T 540 x 26, 200 x 26"},540,26,{"$f":"MIN(C200/2+10,200)","v":200},{"$f":"D200","v":26},{"$f":"C200*D200+E200*F200","v":19240},{"v":409.831184757822,"d":"409.8"},540,26,{"$f":"E200","v":200},{"$f":"F200","v":26},{"$f":"I200*J200+K200*L200","v":19240},{"v":0.02777777777777768,"d":"3%"},{"$f":"1/6*I200*(4*K200*L200+J200*I200+40*I200)","v":{"v":5079600,"d":"5,079,600"}}]
["flat","F 420 x 45",525,37,{"v":208.710325571113,"d":"209"},{"$f":"C201*D201","v":19425},null,276.69929526473317,525,37,0,0,19425,{"v":0.009615384615384581,"d":"1%"}]
["flat","F 420 x 44",500,39,{"v":208.710325571113,"d":"209"},{"$f":"C202*D202","v":19500},null,249.65349948697732,500,39,0,0,19500,{"v":3.8610038610038533E-3,"d":"0%"}]
["built_t",{"$f":"CONCATENATE(\"T \",C203,\" x \",D203, \", \",E203,\" x \",F203)","v":"T 450 x 30, 200 x 30"},450,30,{"$f":"MIN(C203/2+10,200)","v":200},{"$f":"D203","v":30},{"$f":"C203*D203+E203*F203","v":19500},{"v":294.4189545674009,"d":"294.4"},450,30,{"$f":"E203","v":200},30,{"$f":"I203*J203+K203*L203","v":19500},{"v":0,"d":"0%"},{"$f":"1/6*I203*(4*K203*L203+J203*I203+40*I203)","v":{"v":4162500,"d":"4,162,500"}}]
["built_t","T 500 x 28, 200 x 28",500,28,200,28,19600,{"v":351.36418446315326,"d":"351.4"},500,28,200,28,19600,{"v":5.12820512820511E-3,"d":"1%"},{"v":4700000,"d":"4,700,000"}]
["built_t","T 620 x 24, 200 x 24",620,24,200,24,19680,{"v":511.4640389489727,"d":"511.5"},620,24,200,24,19680,{"v":0.004081632653061273,"d":"0%"},{"v":6084266.666666666,"d":"6,084,267"}]
["built_t","T 580 x 26, 200 x 26",580,26,200,26,20280,{"v":440.18905029543845,"d":"440.2"},580,26,200,26,20280,{"v":0.030487804878048808,"d":"3%"},{"v":5711066.666666666,"d":"5,711,067"}]
["built_t","T 660 x 24, 200 x 24",660,24,200,24,20640,{"v":544.4617188811644,"d":"544.5"},660,24,200,24,20640,{"v":0.01775147928994092,"d":"2%"},{"v":6758400,"d":"6,758,400"}]
["built_t","T 620 x 26, 200 x 26",620,26,200,26,21320,{"v":470.54691583305487,"d":"470.5"},620,26,200,26,21320,{"v":0.032945736434108586,"d":"3%"},{"v":6377733.333333333,"d":"6,377,733"}]
["built_t","T 550 x 28, 200 x 30",550,28,200,30,21400,{"v":386.50060290946857,"d":"386.5"},550,28,200,30,21400,{"v":3.7523452157599557E-3,"d":"0%"},{"v":5628333.333333333,"d":"5,628,333"}]
["flat","F 420 x 46",550,39,{"v":208.710325571113,"d":"209"},{"$f":"C210*D210","v":21450},null,274.61884943567503,550,39,0,0,21450,{"v":0.002336448598130758,"d":"0%"}]
["built_t",{"$f":"CONCATENATE(\"T \",C211,\" x \",D211, \", \",E211,\" x \",F211)","v":"T 500 x 30, 200 x 35"},500,30,{"$f":"MIN(C211/2+10,200)","v":200},35,{"$f":"C211*D211+E211*F211","v":22000},{"v":327.1321717415565,"d":"327.1"},500,30,{"$f":"E211","v":200},35,{"$f":"I211*J211+K211*L211","v":22000},{"v":0.02564102564102555,"d":"3%"},{"$f":"1/6*I211*(4*K211*L211+J211*I211+40*I211)","v":{"v":5250000,"d":"5,250,000"}}]
["built_t",{"$f":"CONCATENATE(\"T \",C212,\" x \",D212, \", \",E212,\" x \",F212)","v":"T 660 x 26, 200 x 26"},660,26,{"$f":"MIN(C212/2+10,200)","v":200},{"$f":"D212","v":26},{"$f":"C212*D212+E212*F212","v":22360},{"v":500.9047813706713,"d":"500.9"},660,26,200,26,{"$f":"I212*J212+K212*L212","v":22360},{"v":0.016363636363636358,"d":"2%"},{"$f":"1/6*I212*(4*K212*L212+J212*I212+40*I212)","v":{"v":7079600,"d":"7,079,600"}}]
["built_t",{"$f":"CONCATENATE(\"T \",C213,\" x \",D213, \", \",E213,\" x \",F213)","v":"T 500 x 32, 200 x 32"},500,32,{"$f":"MIN(C213/2+10,200)","v":200},{"$f":"D213","v":32},{"$f":"C213*D213+E213*F213","v":22400},{"v":306.0268703388754,"d":"306.0"},500,32,200,32,{"$f":"I213*J213+K213*L213","v":22400},{"v":1.7889087656528524E-3,"d":"0%"},{"$f":"1/6*I213*(4*K213*L213+J213*I213+40*I213)","v":{"v":5133333.333333333,"d":"5,133,333"}}]
["flat","F 420 x 47",575,40,{"v":208.710325571113,"d":"209"},{"$f":"C214*D214","v":23000},null,279.73994686104896,575,40,0,0,23000,{"v":0.02678571428571419,"d":"3%"}]
["built_t",{"$f":"CONCATENATE(\"T \",C215,\" x \",D215, \", \",E215,\" x \",F215)","v":"T 700 x 26, 200 x 26"},700,26,{"$f":"MIN(C215/2+10,200)","v":200},{"$f":"D215","v":26},{"$f":"C215*D215+E215*F215","v":23400},{"v":531.2626469082877,"d":"531.3"},700,26,{"$f":"E215","v":200},26,{"$f":"I215*J215+K215*L215","v":23400},{"v":0.017391304347825987,"d":"2%"},{"$f":"1/6*I215*(4*K215*L215+J215*I215+40*I215)","v":{"v":7816666.666666666,"d":"7,816,667"}}]
["built_t",{"$f":"CONCATENATE(\"T \",C216,\" x \",D216, \", \",E216,\" x \",F216)","v":"T 550 x 30, 200 x 35"},550,30,{"$f":"MIN(C216/2+10,200)","v":200},35,{"$f":"C216*D216+E216*F216","v":23500},{"v":359.84538891571214,"d":"359.8"},550,30,200,35,{"$f":"I216*J216+K216*L216","v":23500},{"v":0.004273504273504258,"d":"0%"},{"$f":"1/6*I216*(4*K216*L216+J216*I216+40*I216)","v":{"v":6095833.333333333,"d":"6,095,833"}}]
["built_t",{"$f":"CONCATENATE(\"T \",C217,\" x \",D217, \", \",E217,\" x \",F217)","v":"T 600 x 28, 200 x 35"},600,28,{"$f":"MIN(C217/2+10,200)","v":200},35,{"$f":"C217*D217+E217*F217","v":23800},{"v":421.63702135578393,"d":"421.6"},600,28,200,35,{"$f":"I217*J217+K217*L217","v":23800},{"v":0.012765957446808418,"d":"1%"},{"$f":"1/6*I217*(4*K217*L217+J217*I217+40*I217)","v":{"v":6880000,"d":"6,880,000"}}]
["built_t",{"$f":"CONCATENATE(\"T \",C218,\" x \",D218, \", \",E218,\" x \",F218)","v":"T 550 x 32, 200 x 35"},550,32,{"$f":"MIN(C218/2+10,200)","v":200},35,{"$f":"C218*D218+E218*F218","v":24600},{"v":336.6295573727629,"d":"336.6"},550,32,200,35,{"$f":"I218*J218+K218*L218","v":24600},{"v":0.03361344537815136,"d":"3%"},{"$f":"1/6*I218*(4*K218*L218+J218*I218+40*I218)","v":{"v":6196666.666666666,"d":"6,196,667"}}]
["flat","F 420 x 48",600,42,{"v":208.710325571113,"d":"209"},{"$f":"C219*D219","v":25200},null,277.6634043074675,600,42,0,0,25200,{"v":0.024390243902439046,"d":"2%"}]
["built_t",{"$f":"CONCATENATE(\"T \",C220,\" x \",D220, \", \",E220,\" x \",F220)","v":"T 650 x 28, 200 x 35"},650,28,{"$f":"MIN(C220/2+10,200)","v":200},35,{"$f":"C220*D220+E220*F220","v":25200},{"v":456.77343980209923,"d":"456.8"},650,28,{"$f":"E220","v":200},35,{"$f":"I220*J220+K220*L220","v":25200},{"v":0,"d":"0%"},{"$f":"1/6*I220*(4*K220*L220+J220*I220+40*I220)","v":{"v":7821666.666666666,"d":"7,821,667"}}]
["built_t","T 550 x 34, 200 x 35",550,34,200,35,25700,{"v":316.2277660168379,"d":"316.2"},550,34,200,35,25700,{"v":0.01984126984126977,"d":"2%"},{"v":6297499.999999999,"d":"6,297,500"}]
["built_t","T 600 x 30, 200 x 40",600,30,200,40,26000,{"v":392.5586060898678,"d":"392.6"},600,30,200,40,26000,{"v":0.011673151750972721,"d":"1%"},{"v":7400000,"d":"7,400,000"}]
["built_t","T 600 x 32, 200 x 35",600,32,200,35,26200,{"v":367.2322444066505,"d":"367.2"},600,32,200,35,26200,{"v":7.692307692307665E-3,"d":"1%"},{"v":7120000,"d":"7,120,000"}]
["built_t","T 700 x 28, 200 x 35",700,28,200,35,26600,{"v":491.90985824841454,"d":"491.9"},700,28,200,35,26600,{"v":0.01526717557251911,"d":"2%"},{"v":8820000,"d":"8,820,000"}]
["built_t","T 600 x 34, 200 x 35",600,34,200,35,27400,{"v":344.9757447456414,"d":"345.0"},600,34,200,35,27400,{"v":0.03007518796992481,"d":"3%"},{"v":7240000,"d":"7,240,000"}]
["flat","F 420 x 49",625,44,{"v":208.710325571113,"d":"209"},{"$f":"C226*D226","v":27500},null,275.78002850305637,625,44,0,0,27500,{"v":3.6496350364962904E-3,"d":"0%"}]
["built_t",{"$f":"CONCATENATE(\"T \",C227,\" x \",D227, \", \",E227,\" x \",F227)","v":"T 650 x 30, 200 x 40"},650,30,{"$f":"MIN(C227/2+10,200)","v":200},40,{"$f":"C227*D227+E227*F227","v":27500},{"v":425.27182326402345,"d":"425.3"},650,30,{"$f":"E227","v":200},40,{"$f":"I227*J227+K227*L227","v":27500},{"v":0,"d":"0%"},{"$f":"1/6*I227*(4*K227*L227+J227*I227+40*I227)","v":{"v":8395833.333333332,"d":"8,395,833"}}]
["built_t",{"$f":"CONCATENATE(\"T \",C228,\" x \",D228, \", \",E228,\" x \",F228)","v":"T 750 x 28, 200 x 35"},750,28,{"$f":"MIN(C228/2+10,200)","v":200},35,{"$f":"C228*D228+E228*F228","v":28000},{"v":527.04627669473,"d":"527.0"},750,28,200,35,{"$f":"I228*J228+K228*L228","v":28000},{"v":0.018181818181818077,"d":"2%"},{"$f":"1/6*I228*(4*K228*L228+J228*I228+40*I228)","v":{"v":9875000,"d":"9,875,000"}}]
["built_t",{"$f":"CONCATENATE(\"T \",C229,\" x \",D229, \", \",E229,\" x \",F229)","v":"T 650 x 32, 200 x 40"},650,32,{"$f":"MIN(C229/2+10,200)","v":200},40,{"$f":"C229*D229+E229*F229","v":28800},{"v":397.83493144053807,"d":"397.8"},650,32,200,40,{"$f":"I229*J229+K229*L229","v":28800},{"v":0.02857142857142847,"d":"3%"},{"$f":"1/6*I229*(4*K229*L229+J229*I229+40*I229)","v":{"v":8536666.666666666,"d":"8,536,667"}}]
["built_t",{"$f":"CONCATENATE(\"T \",C230,\" x \",D230, \", \",E230,\" x \",F230)","v":"T 700 x 30, 200 x 40"},700,30,{"$f":"MIN(C230/2+10,200)","v":200},40,{"$f":"C230*D230+E230*F230","v":29000},{"v":457.98504043817906,"d":"458.0"},700,30,200,40,{"$f":"I230*J230+K230*L230","v":29000},{"v":0.00694444444444442,"d":"1%"},{"$f":"1/6*I230*(4*K230*L230+J230*I230+40*I230)","v":{"v":9450000,"d":"9,450,000"}}]
["built_t",{"$f":"CONCATENATE(\"T \",C231,\" x \",D231, \", \",E231,\" x \",F231)","v":"T 650 x 34, 200 x 35"},650,34,{"$f":"MIN(C231/2+10,200)","v":200},35,{"$f":"C231*D231+E231*F231","v":29100},{"v":373.72372347444485,"d":"373.7"},650,34,200,35,{"$f":"I231*J231+K231*L231","v":29100},{"v":3.4482758620688614E-3,"d":"0%"},{"$f":"1/6*I231*(4*K231*L231+J231*I231+40*I231)","v":{"v":8244166.666666666,"d":"8,244,167"}}]
["flat","F 420 x 50",650,45,{"v":208.710325571113,"d":"209"},{"$f":"C232*D232","v":29250},null,280.29279260583365,650,45,0,0,29250,{"v":0.005154639175257714,"d":"1%"}]
["built_t",{"$f":"CONCATENATE(\"T \",C233,\" x \",D233, \", \",E233,\" x \",F233)","v":"T 700 x 32, 200 x 40"},700,32,{"$f":"MIN(C233/2+10,200)","v":200},40,{"$f":"C233*D233+E233*F233","v":30400},{"v":428.43761847442556,"d":"428.4"},700,32,{"$f":"E233","v":200},{"$f":"F233","v":40},{"$f":"I233*J233+K233*L233","v":30400},{"v":0.0393162393162394,"d":"4%"},{"$f":"1/6*I233*(4*K233*L233+J233*I233+40*I233)","v":{"v":9613333.333333332,"d":"9,613,333"}}]
["built_t",{"$f":"CONCATENATE(\"T \",C234,\" x \",D234, \", \",E234,\" x \",F234)","v":"T 750 x 30, 200 x 40"},750,30,{"$f":"MIN(C234/2+10,200)","v":200},40,{"$f":"C234*D234+E234*F234","v":30500},{"v":490.69825761233477,"d":"490.7"},750,30,{"$f":"E234","v":200},{"$f":"F234","v":40},{"$f":"I234*J234+K234*L234","v":30500},{"v":0.00328947368421062,"d":"0%"},{"$f":"1/6*I234*(4*K234*L234+J234*I234+40*I234)","v":{"v":10562500,"d":"10,562,500"}}]
["flat","F 420 x 51",675,47,{"v":208.710325571113,"d":"209"},{"$f":"C235*D235","v":31725},null,278.4179244278682,675,47,0,0,31725,{"v":0.04016393442622945,"d":"4%"}]
["built_t",{"$f":"CONCATENATE(\"T \",C236,\" x \",D236, \", \",E236,\" x \",F236)","v":"T 700 x 34, 200 x 40"},700,34,{"$f":"MIN(C236/2+10,200)","v":200},40,{"$f":"C236*D236+E236*F236","v":31800},{"v":402.47170220324824,"d":"402.5"},700,34,{"$f":"E236","v":200},40,{"$f":"I236*J236+K236*L236","v":31800},{"v":2.3640661938533203E-3,"d":"0%"},{"$f":"1/6*I236*(4*K236*L236+J236*I236+40*I236)","v":{"v":9776666.666666666,"d":"9,776,667"}}]
["built_t",{"$f":"CONCATENATE(\"T \",C237,\" x \",D237, \", \",E237,\" x \",F237)","v":"T 750 x 32, 200 x 40"},750,32,{"$f":"MIN(C237/2+10,200)","v":200},40,{"$f":"C237*D237+E237*F237","v":32000},{"v":459.04030550831317,"d":"459.0"},750,32,200,40,{"$f":"I237*J237+K237*L237","v":32000},{"v":6.2893081761006275E-3,"d":"1%"},{"$f":"1/6*I237*(4*K237*L237+J237*I237+40*I237)","v":{"v":10750000,"d":"10,750,000"}}]
["built_t",{"$f":"CONCATENATE(\"T \",C238,\" x \",D238, \", \",E238,\" x \",F238)","v":"T 800 x 30, 200 x 40"},800,30,{"$f":"MIN(C238/2+10,200)","v":200},40,{"$f":"C238*D238+E238*F238","v":32000},{"v":523.4114747864904,"d":"523.4"},800,30,200,40,{"$f":"I238*J238+K238*L238","v":32000},{"v":0,"d":"0%"},{"$f":"1/6*I238*(4*K238*L238+J238*I238+40*I238)","v":{"v":11733333.333333332,"d":"11,733,333"}}]
["built_t",{"$f":"CONCATENATE(\"T \",C239,\" x \",D239, \", \",E239,\" x \",F239)","v":"T 750 x 34, 200 x 40"},750,34,{"$f":"MIN(C239/2+10,200)","v":200},40,{"$f":"C239*D239+E239*F239","v":33500},{"v":431.21968093205174,"d":"431.2"},750,34,200,40,{"$f":"I239*J239+K239*L239","v":33500},{"v":0.046875,"d":"5%"},{"$f":"1/6*I239*(4*K239*L239+J239*I239+40*I239)","v":{"v":10937500,"d":"10,937,500"}}]
["built_t",{"$f":"CONCATENATE(\"T \",C240,\" x \",D240, \", \",E240,\" x \",F240)","v":"T 800 x 32, 200 x 40"},800,32,{"$f":"MIN(C240/2+10,200)","v":200},40,{"$f":"C240*D240+E240*F240","v":33600},{"v":489.64299254220066,"d":"489.6"},800,32,200,40,{"$f":"I240*J240+K240*L240","v":33600},{"v":2.9850746268655914E-3,"d":"0%"},{"$f":"1/6*I240*(4*K240*L240+J240*I240+40*I240)","v":{"v":11946666.666666664,"d":"11,946,667"}}]
["flat","F 420 x 52",700,49,{"v":208.710325571113,"d":"209"},{"$f":"C241*D241","v":34300},null,276.69929526473317,700,49,0,0,34300,{"v":0.02083333333333326,"d":"2%"}]
["built_t",{"$f":"CONCATENATE(\"T \",C242,\" x \",D242, \", \",E242,\" x \",F242)","v":"T 800 x 34, 200 x 40"},800,34,{"$f":"MIN(C242/2+10,200)","v":200},40,{"$f":"C242*D242+E242*F242","v":35200},{"v":459.9676596608552,"d":"460.0"},800,34,{"$f":"E242","v":200},{"$f":"F242","v":40},{"$f":"I242*J242+K242*L242","v":35200},{"v":0.026239067055393583,"d":"3%"},{"$f":"1/6*I242*(4*K242*L242+J242*I242+40*I242)","v":{"v":12159999.999999998,"d":"12,160,000"}}]
["built_t","T 850 x 32, 200 x 40",850,32,200,40,35200,{"v":520.2456795760883,"d":"520.2"},850,32,200,40,35200,{"v":0,"d":"0%"},{"v":13203333.333333332,"d":"13,203,333"}]
["built_t","T 850 x 34, 200 x 40",850,34,200,40,36900,{"v":488.71563838965864,"d":"488.7"},850,34,200,40,36900,{"v":0.048295454545454586,"d":"5%"},{"v":13444166.666666666,"d":"13,444,167"}]
["built_t","T 900 x 34, 200 x 40",900,34,200,40,38600,{"v":517.4636171184621,"d":"517.5"},900,34,200,40,38600,{"v":0.046070460704606964,"d":"5%"},{"v":14790000,"d":"14,790,000"}]
["built_t","T 950 x 35, 200 x 40",950,35,200,40,41250,{"v":530.1465489105813,"d":"530.1"},950,35,200,40,41250,{"v":0.06865284974093266,"d":"7%"},{"v":16347916.666666664,"d":"16,347,917"}]
["built_t","T 1000 x 36, 200 x 40",1000,36,200,40,44000,{"v":542.1047417431507,"d":"542.1"},1000,36,200,40,44000,{"v":0.06666666666666665,"d":"7%"},{"v":18000000,"d":"18,000,000"}]
["built_t","T 1200 x 38, 200 x 40",1200,38,200,40,53600,{"v":615.362139276009,"d":"615.4"},1200,38,200,40,53600,{"v":0.21818181818181825,"d":"22%"},{"v":25120000,"d":"25,120,000"}]
["built_t","T 1400 x 40, 200 x 40",1400,40,200,40,64000,{"v":681.1059575747279,"d":"681.1"},1400,40,200,40,64000,{"v":0.19402985074626855,"d":"19%"},{"v":33600000,"d":"33,600,000"}]
["built_t","T 1600 x 42, 200 x 40",1600,42,200,40,75200,{"v":740.4357448199132,"d":"740.4"},1600,42,200,40,75200,{"v":0.17500000000000004,"d":"18%"},{"v":43519999.99999999,"d":"43,520,000"}]
["built_t","T 1800 x 44, 200 x 40",1800,44,200,40,87200,{"v":794.2464820888023,"d":"794.2"},1800,44,200,40,87200,{"v":0.15957446808510634,"d":"16%"},{"v":54960000,"d":"54,960,000"}]
["built_t","T 2000 x 50, 200 x 41",2000,50,200,41,108200,{"v":774.4353453473582,"d":"774.4"},2000,50,200,41,108200,{"v":0.24082568807339455,"d":"24%"},{"v":70933333.33333333,"d":"70,933,333"}]
["built_t","T 2200 x 55, 200 x 42",2200,55,200,42,129400,{"v":773.0012058189371,"d":"773.0"},2200,55,200,42,129400,{"v":0.1959334565619224,"d":"20%"},{"v":88953333.33333333,"d":"88,953,333"}]